BIOGUIDE_ID,OFFICE,QUARTER,PROGRAM,CATEGORY,SORT SEQUENCE,DATE,TRANSCODE,RECORDID,PAYEE,START DATE,END DATE,PURPOSE,AMOUNT,YEAR
,2005 HON. JO ANN DAVIS,Q3,OFFICIAL EXPENSES OF MEMBERS,PERSONNEL COMPENSATION,DETAIL,   ,   ,   ,CONNELLY CHRISTOPHER P,2005-12-01,2005-12-31,CHIEF OF STAFF/PRESS SECRETARY,3000,2005
,2005 HON. JO ANN DAVIS,Q3,OFFICIAL EXPENSES OF MEMBERS,PERSONNEL COMPENSATION,SUBTOTAL,   ,   ,   ,   ,   ,   ,PERSONNEL COMPENSATION TOTALS:,3000,2005
,2005 HON. JO ANN DAVIS,Q3,OFFICIAL EXPENSES OF MEMBERS,PERSONNEL COMPENSATION,SUBTOTAL,   ,   ,   ,   ,   ,   ,OFFICIAL EXPENSES OF MEMBERS TOTALS:,3000,2005
,2005 HON. JO ANN DAVIS,Q3,OFFICIAL EXPENSES OF MEMBERS,PERSONNEL COMPENSATION,GRAND TOTAL FOR ORGANIZATION,   ,   ,   ,   ,   ,   ,OFFICE TOTALS: ,3000,2005
,2006 HON. JO ANN DAVIS,Q3,OFFICIAL EXPENSES OF MEMBERS,PERSONNEL COMPENSATION,DETAIL,   ,   ,   ,CONNELLY CHRISTOPHER P,2006-12-31,2006-12-31,CHIEF OF STAFF/PRESS SECRETARY,7005.48,2006
,2006 HON. JO ANN DAVIS,Q3,OFFICIAL EXPENSES OF MEMBERS,PERSONNEL COMPENSATION,SUBTOTAL,   ,   ,   ,   ,   ,   ,PERSONNEL COMPENSATION TOTALS:,7005.48,2006
,2006 HON. JO ANN DAVIS,Q3,OFFICIAL EXPENSES OF MEMBERS,PERSONNEL COMPENSATION,SUBTOTAL,   ,   ,   ,   ,   ,   ,OFFICIAL EXPENSES OF MEMBERS TOTALS:,7005.48,2006
,2006 HON. JO ANN DAVIS,Q3,OFFICIAL EXPENSES OF MEMBERS,PERSONNEL COMPENSATION,GRAND TOTAL FOR ORGANIZATION,   ,   ,   ,   ,   ,   ,OFFICE TOTALS: ,7005.48,2006
,2007 HON. JO ANN DAVIS,Q3,OFFICIAL EXPENSES OF MEMBERS,PERSONNEL COMPENSATION,DETAIL,   ,   ,   ,CONNELLY CHRISTOPHER P,2007-12-01,2007-12-01,CHIEF OF STAFF/PRESS SECRETARY,5982.8,2007
,2007 HON. JO ANN DAVIS,Q3,OFFICIAL EXPENSES OF MEMBERS,PERSONNEL COMPENSATION,SUBTOTAL,   ,   ,   ,   ,   ,   ,PERSONNEL COMPENSATION TOTALS:,5982.8,2007
,2007 HON. JO ANN DAVIS,Q3,OFFICIAL EXPENSES OF MEMBERS,PERSONNEL COMPENSATION,SUBTOTAL,   ,   ,   ,   ,   ,   ,OFFICIAL EXPENSES OF MEMBERS TOTALS:,5982.8,2007
,2007 HON. JO ANN DAVIS,Q3,OFFICIAL EXPENSES OF MEMBERS,PERSONNEL COMPENSATION,GRAND TOTAL FOR ORGANIZATION,   ,   ,   ,   ,   ,   ,OFFICE TOTALS: ,5982.8,2007
G000551,2010 HON. RAUL M. GRIJALVA,Q3,OFFICIAL EXPENSES OF MEMBERS,RENT  COMMUNICATION  UTILITIES,DETAIL,2017-08-29,AP,1446,TUCSON ELECTRIC POWER,2010-09-04,2010-10-05,UTILITIES,-798.76,2010
G000551,2010 HON. RAUL M. GRIJALVA,Q3,OFFICIAL EXPENSES OF MEMBERS,RENT  COMMUNICATION  UTILITIES,DETAIL,2017-08-29,AP,941374,TUCSON ELECTRIC POWER,2010-09-04,2010-10-05,UTILITIES,798.76,2010
G000551,2010 HON. RAUL M. GRIJALVA,Q3,OFFICIAL EXPENSES OF MEMBERS,RENT  COMMUNICATION  UTILITIES,SUBTOTAL,   ,   ,   ,   ,   ,   ,RENT  COMMUNICATION  UTILITIES TOTALS:,0,2010
G000551,2010 HON. RAUL M. GRIJALVA,Q3,OFFICIAL EXPENSES OF MEMBERS,RENT  COMMUNICATION  UTILITIES,SUBTOTAL,   ,   ,   ,   ,   ,   ,OFFICIAL EXPENSES OF MEMBERS TOTALS:,0,2010
G000551,2010 HON. RAUL M. GRIJALVA,Q3,OFFICIAL EXPENSES OF MEMBERS,RENT  COMMUNICATION  UTILITIES,GRAND TOTAL FOR ORGANIZATION,   ,   ,   ,   ,   ,   ,OFFICE TOTALS: ,0,2010
,2013 ARMED SERVICES COMMITTEE,Q3,GENERAL EXPENDITURES,OTHER SERVICES,DETAIL,2017-09-15,AP,E0548414,GSL SOLUTIONS INC,2013-11-01,2013-11-30,WEB DEV HST EMAIL & RLTD SERV,75,2013
,2013 ARMED SERVICES COMMITTEE,Q3,GENERAL EXPENDITURES,OTHER SERVICES,SUBTOTAL,   ,   ,   ,   ,   ,   ,OTHER SERVICES TOTALS:,75,2013
,2013 ARMED SERVICES COMMITTEE,Q3,GENERAL EXPENDITURES,OTHER SERVICES,SUBTOTAL,   ,   ,   ,   ,   ,   ,GENERAL EXPENDITURES TOTALS:,75,2013
,2013 ARMED SERVICES COMMITTEE,Q3,GENERAL EXPENDITURES,OTHER SERVICES,GRAND TOTAL FOR ORGANIZATION,   ,   ,   ,   ,   ,   ,OFFICE TOTALS: ,75,2013
R000435,2013 HON. ILEANA ROS-LEHTINEN,Q3,OFFICIAL EXPENSES OF MEMBERS,RENT  COMMUNICATION  UTILITIES,DETAIL,2017-07-06,AP,925101,COMCAST,2013-07-29,2013-08-28,UTILITIES,605.7,2013
R000435,2013 HON. ILEANA ROS-LEHTINEN,Q3,OFFICIAL EXPENSES OF MEMBERS,RENT  COMMUNICATION  UTILITIES,SUBTOTAL,   ,   ,   ,   ,   ,   ,RENT  COMMUNICATION  UTILITIES TOTALS:,605.7,2013
R000435,2013 HON. ILEANA ROS-LEHTINEN,Q3,OFFICIAL EXPENSES OF MEMBERS,RENT  COMMUNICATION  UTILITIES,SUBTOTAL,   ,   ,   ,   ,   ,   ,OFFICIAL EXPENSES OF MEMBERS TOTALS:,605.7,2013
R000435,2013 HON. ILEANA ROS-LEHTINEN,Q3,OFFICIAL EXPENSES OF MEMBERS,RENT  COMMUNICATION  UTILITIES,GRAND TOTAL FOR ORGANIZATION,   ,   ,   ,   ,   ,   ,OFFICE TOTALS: ,605.7,2013
F000460,2014 HON. BLAKE FARENTHOLD,Q3,OFFICIAL EXPENSES OF MEMBERS,RENT  COMMUNICATION  UTILITIES,DETAIL,2017-09-13,AR,AC-13362,VERIZON WIRELESS              ,2015-02-09,2015-02-09,TELECOMSRV/EQ/TOLL CHARGE,-6.96,2015
F000460,2014 HON. BLAKE FARENTHOLD,Q3,OFFICIAL EXPENSES OF MEMBERS,RENT  COMMUNICATION  UTILITIES,SUBTOTAL,   ,   ,   ,   ,   ,   ,RENT  COMMUNICATION  UTILITIES TOTALS:,-6.96,2014
F000460,2014 HON. BLAKE FARENTHOLD,Q3,OFFICIAL EXPENSES OF MEMBERS,RENT  COMMUNICATION  UTILITIES,SUBTOTAL,   ,   ,   ,   ,   ,   ,OFFICIAL EXPENSES OF MEMBERS TOTALS:,-6.96,2014
F000460,2014 HON. BLAKE FARENTHOLD,Q3,OFFICIAL EXPENSES OF MEMBERS,RENT  COMMUNICATION  UTILITIES,GRAND TOTAL FOR ORGANIZATION,   ,   ,   ,   ,   ,   ,OFFICE TOTALS: ,-6.96,2014
H001038,2014 HON. BRIAN HIGGINS,Q3,OFFICIAL EXPENSES OF MEMBERS,EQUIPMENT,DETAIL,2017-08-15,AP,936213,SYMFODIUM LLC,2017-08-08,2017-08-08,COMPUTER HARDW PURCH  LESS THAN $25 000,895,2017
H001038,2014 HON. BRIAN HIGGINS,Q3,OFFICIAL EXPENSES OF MEMBERS,EQUIPMENT,SUBTOTAL,   ,   ,   ,   ,   ,   ,EQUIPMENT TOTALS:,895,2014
H001038,2014 HON. BRIAN HIGGINS,Q3,OFFICIAL EXPENSES OF MEMBERS,EQUIPMENT,SUBTOTAL,   ,   ,   ,   ,   ,   ,OFFICIAL EXPENSES OF MEMBERS TOTALS:,895,2014
H001038,2014 HON. BRIAN HIGGINS,Q3,OFFICIAL EXPENSES OF MEMBERS,EQUIPMENT,GRAND TOTAL FOR ORGANIZATION,   ,   ,   ,   ,   ,   ,OFFICE TOTALS: ,895,2014
B001290,2014 HON. DAVE BRAT,Q3,OFFICIAL EXPENSES OF MEMBERS,RENT  COMMUNICATION  UTILITIES,DETAIL,2017-07-13,AP,E0529923,VERIZON,2014-10-13,2014-11-12,TELECOMSRV/EQ/TOLL CHARGE,207.44,2014
B001290,2014 HON. DAVE BRAT,Q3,OFFICIAL EXPENSES OF MEMBERS,RENT  COMMUNICATION  UTILITIES,SUBTOTAL,   ,   ,   ,   ,   ,   ,RENT  COMMUNICATION  UTILITIES TOTALS:,207.44,2014
B001290,2014 HON. DAVE BRAT,Q3,OFFICIAL EXPENSES OF MEMBERS,EQUIPMENT,DETAIL,2017-08-09,AR,AC-13300,PCMG-G,2015-01-30,2015-01-30,OFFICE EQUIP PURCH LESS THAN $25 000,-594.15,2015
B001290,2014 HON. DAVE BRAT,Q3,OFFICIAL EXPENSES OF MEMBERS,EQUIPMENT,SUBTOTAL,   ,   ,   ,   ,   ,   ,EQUIPMENT TOTALS:,-594.15,2014
B001290,2014 HON. DAVE BRAT,Q3,OFFICIAL EXPENSES OF MEMBERS,EQUIPMENT,SUBTOTAL,   ,   ,   ,   ,   ,   ,OFFICIAL EXPENSES OF MEMBERS TOTALS:,-386.71,2014
B001290,2014 HON. DAVE BRAT,Q3,OFFICIAL EXPENSES OF MEMBERS,EQUIPMENT,GRAND TOTAL FOR ORGANIZATION,   ,   ,   ,   ,   ,   ,OFFICE TOTALS: ,-386.71,2014
P000523,2014 HON. DAVID E. PRICE,Q3,OFFICIAL EXPENSES OF MEMBERS,EQUIPMENT,DETAIL,2017-08-10,AP,935715,SYRACUSE BUSINESS CENTER INC,2017-06-08,2017-06-08,FURNITURE AND FIXTURE  LESS THAN $25 000,3792.35,2017
P000523,2014 HON. DAVID E. PRICE,Q3,OFFICIAL EXPENSES OF MEMBERS,EQUIPMENT,DETAIL,2017-09-27,AP,946650,SYMFODIUM LLC,2017-08-08,2017-08-08,COMPUTER HARDW PURCH  LESS THAN $25 000,1314.96,2017
P000523,2014 HON. DAVID E. PRICE,Q3,OFFICIAL EXPENSES OF MEMBERS,EQUIPMENT,DETAIL,2017-09-27,AP,946651,SYMFODIUM LLC,2017-08-08,2017-08-08,OFFICE EQUIP PURCH LESS THAN $25 000,600,2017
P000523,2014 HON. DAVID E. PRICE,Q3,OFFICIAL EXPENSES OF MEMBERS,EQUIPMENT,DETAIL,2017-09-27,AP,946651,SYMFODIUM LLC,2017-08-08,2017-08-08,COMPUTER HARDW PURCH  LESS THAN $25 000,11916.17,2017
P000523,2014 HON. DAVID E. PRICE,Q3,OFFICIAL EXPENSES OF MEMBERS,EQUIPMENT,SUBTOTAL,   ,   ,   ,   ,   ,   ,EQUIPMENT TOTALS:,17623.48,2014
P000523,2014 HON. DAVID E. PRICE,Q3,OFFICIAL EXPENSES OF MEMBERS,EQUIPMENT,SUBTOTAL,   ,   ,   ,   ,   ,   ,OFFICIAL EXPENSES OF MEMBERS TOTALS:,17623.48,2014
P000523,2014 HON. DAVID E. PRICE,Q3,OFFICIAL EXPENSES OF MEMBERS,EQUIPMENT,GRAND TOTAL FOR ORGANIZATION,   ,   ,   ,   ,   ,   ,OFFICE TOTALS: ,17623.48,2014
M000312,2014 HON. JAMES P. MCGOVERN,Q3,OFFICIAL EXPENSES OF MEMBERS,SUPPLIES AND MATERIALS,DETAIL,2017-08-29,AP,E0543043,FRAMING INC,2014-12-17,2014-12-17,HABITATION EXPENSE,482.99,2014
M000312,2014 HON. JAMES P. MCGOVERN,Q3,OFFICIAL EXPENSES OF MEMBERS,SUPPLIES AND MATERIALS,DETAIL,2017-08-30,AP,E0543042,FRAMING INC,2014-10-31,2014-10-31,HABITATION EXPENSE,376.2,2014
M000312,2014 HON. JAMES P. MCGOVERN,Q3,OFFICIAL EXPENSES OF MEMBERS,SUPPLIES AND MATERIALS,SUBTOTAL,   ,   ,   ,   ,   ,   ,SUPPLIES AND MATERIALS TOTALS:,859.19,2014
M000312,2014 HON. JAMES P. MCGOVERN,Q3,OFFICIAL EXPENSES OF MEMBERS,SUPPLIES AND MATERIALS,SUBTOTAL,   ,   ,   ,   ,   ,   ,OFFICIAL EXPENSES OF MEMBERS TOTALS:,859.19,2014
M000312,2014 HON. JAMES P. MCGOVERN,Q3,OFFICIAL EXPENSES OF MEMBERS,SUPPLIES AND MATERIALS,GRAND TOTAL FOR ORGANIZATION,   ,   ,   ,   ,   ,   ,OFFICE TOTALS: ,859.19,2014
C000090,2014 HON. JOHN  CAMPBELL,Q3,OFFICIAL EXPENSES OF MEMBERS,RENT  COMMUNICATION  UTILITIES,DETAIL,2017-08-25,AR,AC-13332,AT & T                        ,2014-12-02,2015-01-01,TELECOMSRV/EQ/TOLL CHARGE,-48.45,2015
C000090,2014 HON. JOHN  CAMPBELL,Q3,OFFICIAL EXPENSES OF MEMBERS,RENT  COMMUNICATION  UTILITIES,DETAIL,2017-08-25,AR,AC-13333,AT & T                        ,2014-12-07,2015-01-06,TELECOMSRV/EQ/TOLL CHARGE,-6.05,2015
C000090,2014 HON. JOHN  CAMPBELL,Q3,OFFICIAL EXPENSES OF MEMBERS,RENT  COMMUNICATION  UTILITIES,SUBTOTAL,   ,   ,   ,   ,   ,   ,RENT  COMMUNICATION  UTILITIES TOTALS:,-54.5,2014
C000090,2014 HON. JOHN  CAMPBELL,Q3,OFFICIAL EXPENSES OF MEMBERS,RENT  COMMUNICATION  UTILITIES,SUBTOTAL,   ,   ,   ,   ,   ,   ,OFFICIAL EXPENSES OF MEMBERS TOTALS:,-54.5,2014
C000090,2014 HON. JOHN  CAMPBELL,Q3,OFFICIAL EXPENSES OF MEMBERS,RENT  COMMUNICATION  UTILITIES,GRAND TOTAL FOR ORGANIZATION,   ,   ,   ,   ,   ,   ,OFFICE TOTALS: ,-54.5,2014
S000185,"2014 HON. ROBERT C. ""BOBBY"" SCOTT",Q3,OFFICIAL EXPENSES OF MEMBERS,RENT  COMMUNICATION  UTILITIES,DETAIL,2017-08-01,AP,935457,ICONSTITUENT LLC,2017-05-31,2017-05-31,POSTAGE / COURIER / BOX RENTAL,384,2017
S000185,"2014 HON. ROBERT C. ""BOBBY"" SCOTT",Q3,OFFICIAL EXPENSES OF MEMBERS,RENT  COMMUNICATION  UTILITIES,SUBTOTAL,   ,   ,   ,   ,   ,   ,RENT  COMMUNICATION  UTILITIES TOTALS:,384,2014
S000185,"2014 HON. ROBERT C. ""BOBBY"" SCOTT",Q3,OFFICIAL EXPENSES OF MEMBERS,OTHER SERVICES,DETAIL,2017-08-01,AP,935457,ICONSTITUENT LLC,2017-05-31,2017-05-31,NON-TECHNOLOGY SERVICE CONTR,11680,2017
S000185,"2014 HON. ROBERT C. ""BOBBY"" SCOTT",Q3,OFFICIAL EXPENSES OF MEMBERS,OTHER SERVICES,SUBTOTAL,   ,   ,   ,   ,   ,   ,OTHER SERVICES TOTALS:,11680,2014
S000185,"2014 HON. ROBERT C. ""BOBBY"" SCOTT",Q3,OFFICIAL EXPENSES OF MEMBERS,OTHER SERVICES,SUBTOTAL,   ,   ,   ,   ,   ,   ,OFFICIAL EXPENSES OF MEMBERS TOTALS:,12064,2014
S000185,"2014 HON. ROBERT C. ""BOBBY"" SCOTT",Q3,OFFICIAL EXPENSES OF MEMBERS,OTHER SERVICES,GRAND TOTAL FOR ORGANIZATION,   ,   ,   ,   ,   ,   ,OFFICE TOTALS: ,12064,2014
M001185,2014 HON. SEAN PATRICK MALONEY,Q3,OFFICIAL EXPENSES OF MEMBERS,EQUIPMENT,DETAIL,2017-07-24,AP,934987,CDW GOVERNMENT INC. C/O ISM IN,2015-05-28,2015-05-28,COMPUTER HARDW PURCH  LESS THAN $25 000,4135.81,2015
M001185,2014 HON. SEAN PATRICK MALONEY,Q3,OFFICIAL EXPENSES OF MEMBERS,EQUIPMENT,SUBTOTAL,   ,   ,   ,   ,   ,   ,EQUIPMENT TOTALS:,4135.81,2014
M001185,2014 HON. SEAN PATRICK MALONEY,Q3,OFFICIAL EXPENSES OF MEMBERS,EQUIPMENT,SUBTOTAL,   ,   ,   ,   ,   ,   ,OFFICIAL EXPENSES OF MEMBERS TOTALS:,4135.81,2014
M001185,2014 HON. SEAN PATRICK MALONEY,Q3,OFFICIAL EXPENSES OF MEMBERS,EQUIPMENT,GRAND TOTAL FOR ORGANIZATION,   ,   ,   ,   ,   ,   ,OFFICE TOTALS: ,4135.81,2014
,2014 OTHER ADMINISTRATION ,Q3,OFFICIAL EXPENSES OF MEMBERS,FRANKED MAIL,DETAIL,2017-09-07,AP,941576,UNITED STATES POSTAL SERVICE,2013-12-27,2014-12-27,FRANKED MAIL,200,2014
,2014 OTHER ADMINISTRATION ,Q3,OFFICIAL EXPENSES OF MEMBERS,FRANKED MAIL,DETAIL,2017-09-07,AP,941576,UNITED STATES POSTAL SERVICE,2013-12-31,2014-12-31,FRANKED MAIL,200,2014
,2014 OTHER ADMINISTRATION ,Q3,OFFICIAL EXPENSES OF MEMBERS,FRANKED MAIL,SUBTOTAL,   ,   ,   ,   ,   ,   ,FRANKED MAIL TOTALS:,400,2014
,2014 OTHER ADMINISTRATION ,Q3,OFFICIAL EXPENSES OF MEMBERS,FRANKED MAIL,SUBTOTAL,   ,   ,   ,   ,   ,   ,OFFICIAL EXPENSES OF MEMBERS TOTALS:,400,2014
,2014 OTHER ADMINISTRATION ,Q3,OFFICIAL EXPENSES OF MEMBERS,FRANKED MAIL,GRAND TOTAL FOR ORGANIZATION,   ,   ,   ,   ,   ,   ,OFFICE TOTALS: ,400,2014
,2015 ARMED SERVICES COMMITTEE,Q3,GENERAL EXPENDITURES,OTHER SERVICES,DETAIL,2017-09-12,AP,E0548420,GSL SOLUTIONS INC,2015-03-01,2015-03-31,WEB DEV HST EMAIL & RLTD SERV,75,2015
,2015 ARMED SERVICES COMMITTEE,Q3,GENERAL EXPENDITURES,OTHER SERVICES,SUBTOTAL,   ,   ,   ,   ,   ,   ,OTHER SERVICES TOTALS:,75,2015
,2015 ARMED SERVICES COMMITTEE,Q3,GENERAL EXPENDITURES,OTHER SERVICES,SUBTOTAL,   ,   ,   ,   ,   ,   ,GENERAL EXPENDITURES TOTALS:,75,2015
,2015 ARMED SERVICES COMMITTEE,Q3,GENERAL EXPENDITURES,OTHER SERVICES,GRAND TOTAL FOR ORGANIZATION,   ,   ,   ,   ,   ,   ,OFFICE TOTALS: ,75,2015
,2015 CAO ADVANCED BUSINESS SOLUTION,Q3,CONGRESSIONAL TRANSITION,OTHER SERVICES,DETAIL,2017-07-12,AP,930536,NEWPORT HALL,2017-06-01,2017-06-30,TECHNOLOGY SERVICE CONTRACTS,8467.22,2017
,2015 CAO ADVANCED BUSINESS SOLUTION,Q3,CONGRESSIONAL TRANSITION,OTHER SERVICES,DETAIL,2017-08-23,AP,940679,NEWPORT HALL,2017-07-03,2017-07-31,TECHNOLOGY SERVICE CONTRACTS,11338.08,2017
,2015 CAO ADVANCED BUSINESS SOLUTION,Q3,CONGRESSIONAL TRANSITION,OTHER SERVICES,DETAIL,2017-09-13,AP,941793,NEWPORT HALL,2017-08-01,2017-08-31,TECHNOLOGY SERVICE CONTRACTS,12500.96,2017
,2015 CAO ADVANCED BUSINESS SOLUTION,Q3,CONGRESSIONAL TRANSITION,OTHER SERVICES,SUBTOTAL,   ,   ,   ,   ,   ,   ,OTHER SERVICES TOTALS:,32306.26,2015
,2015 CAO ADVANCED BUSINESS SOLUTION,Q3,CONGRESSIONAL TRANSITION,OTHER SERVICES,SUBTOTAL,   ,   ,   ,   ,   ,   ,CONGRESSIONAL TRANSITION TOTALS:,32306.26,2015
,2015 CAO ADVANCED BUSINESS SOLUTION,Q3,CONGRESSIONAL TRANSITION,OTHER SERVICES,GRAND TOTAL FOR ORGANIZATION,   ,   ,   ,   ,   ,   ,OFFICE TOTALS: ,32306.26,2015
,2015 COMMITTEE ON ENERGY & COMMERCE,Q3,GENERAL EXPENDITURES,EQUIPMENT,DETAIL,2017-08-23,AP,940746,PRO SOUND & VIDEO INC,2017-08-22,2017-08-22,OFFICE EQUIPMENT PURCH  GREATER THAN OR =$25K,38145.44,2017
,2015 COMMITTEE ON ENERGY & COMMERCE,Q3,GENERAL EXPENDITURES,EQUIPMENT,SUBTOTAL,   ,   ,   ,   ,   ,   ,EQUIPMENT TOTALS:,38145.44,2015
,2015 COMMITTEE ON ENERGY & COMMERCE,Q3,GENERAL EXPENDITURES,EQUIPMENT,SUBTOTAL,   ,   ,   ,   ,   ,   ,GENERAL EXPENDITURES TOTALS:,38145.44,2015
,2015 COMMITTEE ON ENERGY & COMMERCE,Q3,GENERAL EXPENDITURES,EQUIPMENT,GRAND TOTAL FOR ORGANIZATION,   ,   ,   ,   ,   ,   ,OFFICE TOTALS: ,38145.44,2015
,2015 COMMITTEE ON JUDICIARY,Q3,GENERAL EXPENDITURES,EQUIPMENT,DETAIL,2017-08-23,AP,940747,PRO SOUND & VIDEO INC,2016-12-22,2016-12-22,COMPUTER HARDW PURCH  LESS THAN $25 000,38145.44,2016
,2015 COMMITTEE ON JUDICIARY,Q3,GENERAL EXPENDITURES,EQUIPMENT,SUBTOTAL,   ,   ,   ,   ,   ,   ,EQUIPMENT TOTALS:,38145.44,2015
,2015 COMMITTEE ON JUDICIARY,Q3,GENERAL EXPENDITURES,EQUIPMENT,SUBTOTAL,   ,   ,   ,   ,   ,   ,GENERAL EXPENDITURES TOTALS:,38145.44,2015
,2015 COMMITTEE ON JUDICIARY,Q3,GENERAL EXPENDITURES,EQUIPMENT,GRAND TOTAL FOR ORGANIZATION,   ,   ,   ,   ,   ,   ,OFFICE TOTALS: ,38145.44,2015
,2015 COMMITTEE ON NATURAL RESOURCES,Q3,GENERAL EXPENDITURES,SUPPLIES AND MATERIALS,DETAIL,2017-07-06,AP,929873,CDW GOVERNMENT INC. C/O ISM IN,2016-01-13,2016-01-13,SOFTWARE  LESS THAN  $500 QTY - 100,13571,2016
,2015 COMMITTEE ON NATURAL RESOURCES,Q3,GENERAL EXPENDITURES,SUPPLIES AND MATERIALS,SUBTOTAL,   ,   ,   ,   ,   ,   ,SUPPLIES AND MATERIALS TOTALS:,13571,2015
,2015 COMMITTEE ON NATURAL RESOURCES,Q3,GENERAL EXPENDITURES,SUPPLIES AND MATERIALS,SUBTOTAL,   ,   ,   ,   ,   ,   ,GENERAL EXPENDITURES TOTALS:,13571,2015
,2015 COMMITTEE ON NATURAL RESOURCES,Q3,GENERAL EXPENDITURES,SUPPLIES AND MATERIALS,GRAND TOTAL FOR ORGANIZATION,   ,   ,   ,   ,   ,   ,OFFICE TOTALS: ,13571,2015
,2015 COMMITTEE ON WAYS AND MEANS,Q3,GENERAL EXPENDITURES,TRAVEL,DETAIL,2017-07-28,AP,932375,CITIBANK GOV CARD SERVICE,2015-10-01,2015-10-05,COMMERCIAL TRANSPORTATION,78.67,2015
,2015 COMMITTEE ON WAYS AND MEANS,Q3,GENERAL EXPENDITURES,TRAVEL,SUBTOTAL,   ,   ,   ,   ,   ,   ,TRAVEL TOTALS:,78.67,2015
,2015 COMMITTEE ON WAYS AND MEANS,Q3,GENERAL EXPENDITURES,TRAVEL,SUBTOTAL,   ,   ,   ,   ,   ,   ,GENERAL EXPENDITURES TOTALS:,78.67,2015
,2015 COMMITTEE ON WAYS AND MEANS,Q3,GENERAL EXPENDITURES,TRAVEL,GRAND TOTAL FOR ORGANIZATION,   ,   ,   ,   ,   ,   ,OFFICE TOTALS: ,78.67,2015
,2015 HIR IMMEDIATE OFFICE,Q3,IDENTITY ACCESS MANAGEMENT,OTHER SERVICES,DETAIL,2017-07-03,AP,929920,CONVERGE NETWORKS CORP,2017-04-18,2017-05-17,CONSULTANT CONTRACT SERVICE,24220,2017
,2015 HIR IMMEDIATE OFFICE,Q3,IDENTITY ACCESS MANAGEMENT,OTHER SERVICES,DETAIL,2017-07-03,AP,929958,CONVERGE NETWORKS CORP,2017-05-18,2017-06-18,CONSULTANT CONTRACT SERVICE,22420.8,2017
,2015 HIR IMMEDIATE OFFICE,Q3,IDENTITY ACCESS MANAGEMENT,OTHER SERVICES,DETAIL,2017-09-08,AP,941607,CONVERGE NETWORKS CORP,2017-06-19,2017-07-18,CONSULTANT CONTRACT SERVICE,23251.2,2017
,2015 HIR IMMEDIATE OFFICE,Q3,IDENTITY ACCESS MANAGEMENT,OTHER SERVICES,DETAIL,2017-09-08,AP,941611,CONVERGE NETWORKS CORP,2017-07-19,2017-08-18,CONSULTANT CONTRACT SERVICE,20344.8,2017
,2015 HIR IMMEDIATE OFFICE,Q3,IDENTITY ACCESS MANAGEMENT,OTHER SERVICES,DETAIL,2017-09-27,AP,946635,CONVERGE NETWORKS CORP,2017-08-19,2017-09-19,CONSULTANT CONTRACT SERVICE,23251.2,2017
,2015 HIR IMMEDIATE OFFICE,Q3,IDENTITY ACCESS MANAGEMENT,OTHER SERVICES,SUBTOTAL,   ,   ,   ,   ,   ,   ,OTHER SERVICES TOTALS:,113488,2015
,2015 HIR IMMEDIATE OFFICE,Q3,IDENTITY ACCESS MANAGEMENT,OTHER SERVICES,SUBTOTAL,   ,   ,   ,   ,   ,   ,IDENTITY ACCESS MANAGEMENT TOTALS:,113488,2015
,2015 HIR IMMEDIATE OFFICE,Q3,IDENTITY ACCESS MANAGEMENT,OTHER SERVICES,GRAND TOTAL FOR ORGANIZATION,   ,   ,   ,   ,   ,   ,OFFICE TOTALS: ,113488,2015
,2015 HOMELAND SECURITY,Q3,GENERAL EXPENDITURES,SUPPLIES AND MATERIALS,DETAIL,2017-07-18,AP,932291,CDW GOVERNMENT INC. C/O ISM IN,2016-01-11,2016-01-11,OFFICE SUPPLIES (OUTSIDE),147.15,2016
,2015 HOMELAND SECURITY,Q3,GENERAL EXPENDITURES,SUPPLIES AND MATERIALS,DETAIL,2017-07-18,AP,932291,CDW GOVERNMENT INC. C/O ISM IN,2016-01-11,2016-01-11,OFFICE SUPPLIES (OUTSIDE) QTY - 10,414.4,2016
,2015 HOMELAND SECURITY,Q3,GENERAL EXPENDITURES,SUPPLIES AND MATERIALS,DETAIL,2017-07-18,AP,932291,CDW GOVERNMENT INC. C/O ISM IN,2016-01-11,2016-01-11,OFFICE SUPPLIES (OUTSIDE) QTY - 20,501,2016
,2015 HOMELAND SECURITY,Q3,GENERAL EXPENDITURES,SUPPLIES AND MATERIALS,DETAIL,2017-07-18,AP,932291,CDW GOVERNMENT INC. C/O ISM IN,2016-01-11,2016-01-11,OFFICE SUPPLIES (OUTSIDE) QTY - 5,1575.35,2016
,2015 HOMELAND SECURITY,Q3,GENERAL EXPENDITURES,SUPPLIES AND MATERIALS,SUBTOTAL,   ,   ,   ,   ,   ,   ,SUPPLIES AND MATERIALS TOTALS:,2637.9,2015
,2015 HOMELAND SECURITY,Q3,GENERAL EXPENDITURES,EQUIPMENT,DETAIL,2017-07-06,AP,929950,CDW GOVERNMENT INC. C/O ISM IN,2016-01-07,2016-01-07,COMPUTER HARDW PURCH  LESS THAN $25 000,11619.7,2016
,2015 HOMELAND SECURITY,Q3,GENERAL EXPENDITURES,EQUIPMENT,DETAIL,2017-07-18,AP,932291,CDW GOVERNMENT INC. C/O ISM IN,2016-01-11,2016-01-11,COMPUTER HARDW PURCH  LESS THAN $25 000,6439.39,2016
,2015 HOMELAND SECURITY,Q3,GENERAL EXPENDITURES,EQUIPMENT,SUBTOTAL,   ,   ,   ,   ,   ,   ,EQUIPMENT TOTALS:,18059.09,2015
,2015 HOMELAND SECURITY,Q3,GENERAL EXPENDITURES,EQUIPMENT,SUBTOTAL,   ,   ,   ,   ,   ,   ,GENERAL EXPENDITURES TOTALS:,20696.99,2015
,2015 HOMELAND SECURITY,Q3,GENERAL EXPENDITURES,EQUIPMENT,GRAND TOTAL FOR ORGANIZATION,   ,   ,   ,   ,   ,   ,OFFICE TOTALS: ,20696.99,2015
C001072,2015 HON. ANDRE CARSON,Q3,OFFICIAL EXPENSES OF MEMBERS,OTHER SERVICES,DETAIL,2017-09-12,AP,E0544278,SYMFODIUM LLC,2015-04-22,2015-04-22,TECHNOLOGY SERVICE CONTRACTS,2500,2015
C001072,2015 HON. ANDRE CARSON,Q3,OFFICIAL EXPENSES OF MEMBERS,OTHER SERVICES,SUBTOTAL,   ,   ,   ,   ,   ,   ,OTHER SERVICES TOTALS:,2500,2015
C001072,2015 HON. ANDRE CARSON,Q3,OFFICIAL EXPENSES OF MEMBERS,OTHER SERVICES,SUBTOTAL,   ,   ,   ,   ,   ,   ,OFFICIAL EXPENSES OF MEMBERS TOTALS:,2500,2015
C001072,2015 HON. ANDRE CARSON,Q3,OFFICIAL EXPENSES OF MEMBERS,OTHER SERVICES,GRAND TOTAL FOR ORGANIZATION,   ,   ,   ,   ,   ,   ,OFFICE TOTALS: ,2500,2015
H001052,2015 HON. ANDY HARRIS,Q3,OFFICIAL EXPENSES OF MEMBERS,RENT  COMMUNICATION  UTILITIES,DETAIL,2017-07-12,AP,E0528592,QUEEN ANNES COUNTY BOARD OF EDUCATION,2015-12-01,2015-12-31,TEMPORARY SPACE RENTAL,189,2015
H001052,2015 HON. ANDY HARRIS,Q3,OFFICIAL EXPENSES OF MEMBERS,RENT  COMMUNICATION  UTILITIES,SUBTOTAL,   ,   ,   ,   ,   ,   ,RENT  COMMUNICATION  UTILITIES TOTALS:,189,2015
H001052,2015 HON. ANDY HARRIS,Q3,OFFICIAL EXPENSES OF MEMBERS,RENT  COMMUNICATION  UTILITIES,SUBTOTAL,   ,   ,   ,   ,   ,   ,OFFICIAL EXPENSES OF MEMBERS TOTALS:,189,2015
H001052,2015 HON. ANDY HARRIS,Q3,OFFICIAL EXPENSES OF MEMBERS,RENT  COMMUNICATION  UTILITIES,GRAND TOTAL FOR ORGANIZATION,   ,   ,   ,   ,   ,   ,OFFICE TOTALS: ,189,2015
L000551,2015 HON. BARBARA LEE,Q3,OFFICIAL EXPENSES OF MEMBERS,EQUIPMENT,DETAIL,2017-07-03,AP,929830,LEIDOS DIGITAL SOLUTIONS INC,2016-10-28,2016-10-28,COMPUTER HARDW PURCH  LESS THAN $25 000,8434.59,2016
L000551,2015 HON. BARBARA LEE,Q3,OFFICIAL EXPENSES OF MEMBERS,EQUIPMENT,SUBTOTAL,   ,   ,   ,   ,   ,   ,EQUIPMENT TOTALS:,8434.59,2015
L000551,2015 HON. BARBARA LEE,Q3,OFFICIAL EXPENSES OF MEMBERS,EQUIPMENT,SUBTOTAL,   ,   ,   ,   ,   ,   ,OFFICIAL EXPENSES OF MEMBERS TOTALS:,8434.59,2015
L000551,2015 HON. BARBARA LEE,Q3,OFFICIAL EXPENSES OF MEMBERS,EQUIPMENT,GRAND TOTAL FOR ORGANIZATION,   ,   ,   ,   ,   ,   ,OFFICE TOTALS: ,8434.59,2015
L000576,2015 HON. BILLY LONG,Q3,OFFICIAL EXPENSES OF MEMBERS,RENT  COMMUNICATION  UTILITIES,DETAIL,2017-09-12,AP,E0548355,AT&T,2015-07-23,2015-08-24,TELECOMSRV/EQ/TOLL CHARGE,15,2015
L000576,2015 HON. BILLY LONG,Q3,OFFICIAL EXPENSES OF MEMBERS,RENT  COMMUNICATION  UTILITIES,DETAIL,2017-09-28,AP,E0548354,AT&T,2015-05-23,2015-06-22,TELECOMSRV/EQ/TOLL CHARGE,15,2015
L000576,2015 HON. BILLY LONG,Q3,OFFICIAL EXPENSES OF MEMBERS,RENT  COMMUNICATION  UTILITIES,DETAIL,2017-09-28,AP,E0548356,AT&T,2015-10-23,2015-11-22,TELECOMSRV/EQ/TOLL CHARGE,15,2015
L000576,2015 HON. BILLY LONG,Q3,OFFICIAL EXPENSES OF MEMBERS,RENT  COMMUNICATION  UTILITIES,DETAIL,2017-09-28,AP,E0548357,AT&T,2015-11-23,2015-12-22,TELECOMSRV/EQ/TOLL CHARGE,15,2015
L000576,2015 HON. BILLY LONG,Q3,OFFICIAL EXPENSES OF MEMBERS,RENT  COMMUNICATION  UTILITIES,SUBTOTAL,   ,   ,   ,   ,   ,   ,RENT  COMMUNICATION  UTILITIES TOTALS:,60,2015
L000576,2015 HON. BILLY LONG,Q3,OFFICIAL EXPENSES OF MEMBERS,PRINTING AND REPRODUCTION,DETAIL,2017-09-12,AP,E0546294,LAKELAND OFFICE SYSTEMS,2015-12-31,2015-12-31,PRINTING & REPRODUCTION,15.21,2015
L000576,2015 HON. BILLY LONG,Q3,OFFICIAL EXPENSES OF MEMBERS,PRINTING AND REPRODUCTION,DETAIL,2017-09-12,AP,E0546295,LAKELAND OFFICE SYSTEMS,2015-11-01,2015-11-30,PRINTING & REPRODUCTION,14.58,2015
L000576,2015 HON. BILLY LONG,Q3,OFFICIAL EXPENSES OF MEMBERS,PRINTING AND REPRODUCTION,SUBTOTAL,   ,   ,   ,   ,   ,   ,PRINTING AND REPRODUCTION TOTALS:,29.79,2015
L000576,2015 HON. BILLY LONG,Q3,OFFICIAL EXPENSES OF MEMBERS,PRINTING AND REPRODUCTION,SUBTOTAL,   ,   ,   ,   ,   ,   ,OFFICIAL EXPENSES OF MEMBERS TOTALS:,89.79,2015
L000576,2015 HON. BILLY LONG,Q3,OFFICIAL EXPENSES OF MEMBERS,PRINTING AND REPRODUCTION,GRAND TOTAL FOR ORGANIZATION,   ,   ,   ,   ,   ,   ,OFFICE TOTALS: ,89.79,2015
W000822,2015 HON. BONNIE WATSON COLEMAN,Q3,OFFICIAL EXPENSES OF MEMBERS,SUPPLIES AND MATERIALS,DETAIL,2017-08-04,AP,935430,CDW GOVERNMENT INC. C/O ISM IN,2015-09-21,2015-09-21,OFFICE SUPPLIES (OUTSIDE),226.49,2015
W000822,2015 HON. BONNIE WATSON COLEMAN,Q3,OFFICIAL EXPENSES OF MEMBERS,SUPPLIES AND MATERIALS,SUBTOTAL,   ,   ,   ,   ,   ,   ,SUPPLIES AND MATERIALS TOTALS:,226.49,2015