BIOGUIDE_ID,OFFICE,QUARTER,PROGRAM,CATEGORY,SORT SEQUENCE,DATE,TRANSCODE,RECORDID,PAYEE,START DATE,END DATE,PURPOSE,AMOUNT,YEAR
,2018 OFFICE OF THE SPEAKER,Q3,GENERAL EXPENDITURES,FRANKED MAIL,DETAIL,2018-07-30,AP,1004914,UNITED STATES POSTAL SERVICE,2018-06-01,2018-06-30,FRANKED MAIL,253.98,2018
,2018 OFFICE OF THE SPEAKER,Q3,GENERAL EXPENDITURES,FRANKED MAIL,DETAIL,2018-08-29,AP,1010761,UNITED STATES POSTAL SERVICE,2018-07-01,2018-07-31,FRANKED MAIL,102.53,2018
,2018 OFFICE OF THE SPEAKER,Q3,GENERAL EXPENDITURES,FRANKED MAIL,DETAIL,2018-09-26,AP,1018428,UNITED STATES POSTAL SERVICE,2018-08-01,2018-08-31,FRANKED MAIL,73.55,2018
,2018 OFFICE OF THE SPEAKER,Q3,GENERAL EXPENDITURES,FRANKED MAIL,SUBTOTAL,   ,   ,   ,   ,   ,   ,FRANKED MAIL TOTALS:,430.06,2018
,2018 OFFICE OF THE SPEAKER,Q3,GENERAL EXPENDITURES,PERSONNEL COMPENSATION,DETAIL,   ,   ,   ,ALTHOUSE JOSHUA S,2018-07-01,2018-07-06,CONSERVATIVE OUTREACH DIRECTOR,1333.33,2018
,2018 OFFICE OF THE SPEAKER,Q3,GENERAL EXPENDITURES,PERSONNEL COMPENSATION,DETAIL,   ,   ,   ,ALTHOUSE JOSHUA S,2018-07-01,2018-07-06,CONSERVATIVE OUTREACH DIRECTOR (OTHER COMPENSATION),3333.33,2018
,2018 OFFICE OF THE SPEAKER,Q3,GENERAL EXPENDITURES,PERSONNEL COMPENSATION,DETAIL,   ,   ,   ,ANDRES DOUGLAS R,2018-07-01,2018-09-30,PRESS SECRETARY,28022.49,2018
,2018 OFFICE OF THE SPEAKER,Q3,GENERAL EXPENDITURES,PERSONNEL COMPENSATION,DETAIL,   ,   ,   ,ANDREWS THOMAS S,2018-07-01,2018-09-14,MEMBER SERVICES DIRECTOR,26722.22,2018
,2018 OFFICE OF THE SPEAKER,Q3,GENERAL EXPENDITURES,PERSONNEL COMPENSATION,DETAIL,   ,   ,   ,ANDREWS THOMAS S,2018-09-01,2018-09-14,MEMBER SERVICES DIRECTOR (OTHER COMPENSATION),3069.44,2018
,2018 OFFICE OF THE SPEAKER,Q3,GENERAL EXPENDITURES,PERSONNEL COMPENSATION,DETAIL,   ,   ,   ,ANTELL GEOFFREY,2018-07-01,2018-09-30,ASST TO THE SPEAKER FOR POLICY,42033.75,2018
,2018 OFFICE OF THE SPEAKER,Q3,GENERAL EXPENDITURES,PERSONNEL COMPENSATION,DETAIL,   ,   ,   ,APPLE MATTHEW J,2018-07-01,2018-09-30,STAFF ASSISTANT,8750.01,2018
,2018 OFFICE OF THE SPEAKER,Q3,GENERAL EXPENDITURES,PERSONNEL COMPENSATION,DETAIL,   ,   ,   ,APPLE MATTHEW J,2018-05-01,2018-07-31,STAFF ASSISTANT (OVERTIME),422.77,2018
,2018 OFFICE OF THE SPEAKER,Q3,GENERAL EXPENDITURES,PERSONNEL COMPENSATION,DETAIL,   ,   ,   ,ARRIETA-WALDEN MAYA E,2018-07-01,2018-09-30,COMMUNICATIONS ADVISOR,16250.01,2018
,2018 OFFICE OF THE SPEAKER,Q3,GENERAL EXPENDITURES,PERSONNEL COMPENSATION,DETAIL,   ,   ,   ,BATTAGLIA JACQUELINE P,2018-09-19,2018-09-30,STAFF ASSISTANT  SPECIAL EVENT,1166.67,2018
,2018 OFFICE OF THE SPEAKER,Q3,GENERAL EXPENDITURES,PERSONNEL COMPENSATION,DETAIL,   ,   ,   ,BENJAMIN WILLIAM C.,2018-07-01,2018-09-30,SYSTEM ADMINISTRATOR,13250.01,2018
,2018 OFFICE OF THE SPEAKER,Q3,GENERAL EXPENDITURES,PERSONNEL COMPENSATION,DETAIL,   ,   ,   ,BLAKE KRISTENE,2018-07-01,2018-09-07,DIR OF ADMIN OPERATIONS,25125,2018
,2018 OFFICE OF THE SPEAKER,Q3,GENERAL EXPENDITURES,PERSONNEL COMPENSATION,DETAIL,   ,   ,   ,BLAKE KRISTENE,2018-09-01,2018-09-07,DIR OF ADMIN OPERATIONS (OTHER COMPENSATION),5625,2018
,2018 OFFICE OF THE SPEAKER,Q3,GENERAL EXPENDITURES,PERSONNEL COMPENSATION,DETAIL,   ,   ,   ,BLANKENSHIP APRIL L.,2018-07-01,2018-09-30,FINANCIAL ADMINISTRATOR,5702.76,2018
,2018 OFFICE OF THE SPEAKER,Q3,GENERAL EXPENDITURES,PERSONNEL COMPENSATION,DETAIL,   ,   ,   ,BUCK BRENDAN K,2018-07-01,2018-09-30,COUNSELOR TO THE SPEAKER,43125,2018
,2018 OFFICE OF THE SPEAKER,Q3,GENERAL EXPENDITURES,PERSONNEL COMPENSATION,DETAIL,   ,   ,   ,BURKS JONATHAN,2018-07-01,2018-09-30,CHIEF OF STAFF,43125,2018
,2018 OFFICE OF THE SPEAKER,Q3,GENERAL EXPENDITURES,PERSONNEL COMPENSATION,DETAIL,   ,   ,   ,CALLAS GEORGE A,2018-07-01,2018-07-11,CHIEF TAX COUNSEL,5215.71,2018
,2018 OFFICE OF THE SPEAKER,Q3,GENERAL EXPENDITURES,PERSONNEL COMPENSATION,DETAIL,   ,   ,   ,CALLAS GEORGE A,2018-07-01,2018-07-11,CHIEF TAX COUNSEL (OTHER COMPENSATION),7112.33,2018
,2018 OFFICE OF THE SPEAKER,Q3,GENERAL EXPENDITURES,PERSONNEL COMPENSATION,DETAIL,   ,   ,   ,CAMERON JESSICA E,2018-07-01,2018-07-31,LAW CLERK,6250,2018
,2018 OFFICE OF THE SPEAKER,Q3,GENERAL EXPENDITURES,PERSONNEL COMPENSATION,DETAIL,   ,   ,   ,CAMERON JESSICA E,2018-07-01,2018-07-31,LAW CLERK (OTHER COMPENSATION),2552.08,2018
,2018 OFFICE OF THE SPEAKER,Q3,GENERAL EXPENDITURES,PERSONNEL COMPENSATION,DETAIL,   ,   ,   ,COYLE SARAH M,2018-06-01,2018-09-30,FLOOR ASSISTANT,13326.39,2018
,2018 OFFICE OF THE SPEAKER,Q3,GENERAL EXPENDITURES,PERSONNEL COMPENSATION,DETAIL,   ,   ,   ,DOCKERY DERRICK D,2018-07-01,2018-09-30,INTERGOVERNMENTAL OUTREACH DIR,20000.01,2018
,2018 OFFICE OF THE SPEAKER,Q3,GENERAL EXPENDITURES,PERSONNEL COMPENSATION,DETAIL,   ,   ,   ,DRESSLER JEFFREY A,2018-07-01,2018-09-30,ASST TO THE SPEAKER FOR POLICY,28022.49,2018
,2018 OFFICE OF THE SPEAKER,Q3,GENERAL EXPENDITURES,PERSONNEL COMPENSATION,DETAIL,   ,   ,   ,EASBY-SMITH ANNE S.,2018-07-01,2018-09-13,SPECIAL EVENTS COORDINATOR,24333.33,2018
,2018 OFFICE OF THE SPEAKER,Q3,GENERAL EXPENDITURES,PERSONNEL COMPENSATION,DETAIL,   ,   ,   ,EASBY-SMITH ANNE S.,2018-09-01,2018-09-13,SPECIAL EVENTS COORDINATOR (OTHER COMPENSATION),5000,2018
,2018 OFFICE OF THE SPEAKER,Q3,GENERAL EXPENDITURES,PERSONNEL COMPENSATION,DETAIL,   ,   ,   ,EDWARDS SPENCER M,2018-07-01,2018-09-20,DIRECTOR OF PRESS OPERATIONS,17460.45,2018
,2018 OFFICE OF THE SPEAKER,Q3,GENERAL EXPENDITURES,PERSONNEL COMPENSATION,DETAIL,   ,   ,   ,EDWARDS SPENCER M,2018-09-01,2018-09-20,DIRECTOR OF PRESS OPERATIONS (OTHER COMPENSATION),3273.83,2018
,2018 OFFICE OF THE SPEAKER,Q3,GENERAL EXPENDITURES,PERSONNEL COMPENSATION,DETAIL,   ,   ,   ,EICHHORN JARED D.,2018-06-01,2018-06-15,CLOAKROOM DIRECTOR (OTHER COMPENSATION),4166.67,2018
,2018 OFFICE OF THE SPEAKER,Q3,GENERAL EXPENDITURES,PERSONNEL COMPENSATION,DETAIL,   ,   ,   ,EPLEY MARK D,2018-07-01,2018-09-30,SENIOR ADVISOR AND GENERAL COU,43125,2018
,2018 OFFICE OF THE SPEAKER,Q3,GENERAL EXPENDITURES,PERSONNEL COMPENSATION,DETAIL,   ,   ,   ,FOLTZ DEVON N,2018-07-01,2018-07-13,DEPUTY FLOOR DIRECTOR/COUNSEL,5055.56,2018
,2018 OFFICE OF THE SPEAKER,Q3,GENERAL EXPENDITURES,PERSONNEL COMPENSATION,DETAIL,   ,   ,   ,FOLTZ DEVON N,2018-07-01,2018-07-13,DEPUTY FLOOR DIRECTOR/COUNSEL (OTHER COMPENSATION),5833.33,2018
,2018 OFFICE OF THE SPEAKER,Q3,GENERAL EXPENDITURES,PERSONNEL COMPENSATION,DETAIL,   ,   ,   ,GALLAGHER MEGAN E,2018-08-20,2018-09-30,STAFF ASSISTANT,3986.11,2018
,2018 OFFICE OF THE SPEAKER,Q3,GENERAL EXPENDITURES,PERSONNEL COMPENSATION,DETAIL,   ,   ,   ,GILLESPIE JAMES M,2018-06-01,2018-09-30,FLOOR ASSISTANT,12338.88,2018
,2018 OFFICE OF THE SPEAKER,Q3,GENERAL EXPENDITURES,PERSONNEL COMPENSATION,DETAIL,   ,   ,   ,GUAGLIANONE PAUL D,2018-07-01,2018-09-30,DIRECTOR OF CONSERVATIVE COALI,15866.67,2018
,2018 OFFICE OF THE SPEAKER,Q3,GENERAL EXPENDITURES,PERSONNEL COMPENSATION,DETAIL,   ,   ,   ,HALPERN HUGH N.,2018-07-01,2018-09-30,FLOOR DIRECTOR - STATUTORY,43125,2018
,2018 OFFICE OF THE SPEAKER,Q3,GENERAL EXPENDITURES,PERSONNEL COMPENSATION,DETAIL,   ,   ,   ,HEMINGWAY JENNIFER A,2018-07-01,2018-09-30,DIRECTOR OF HOUSE OPERATIONS,43125,2018
,2018 OFFICE OF THE SPEAKER,Q3,GENERAL EXPENDITURES,PERSONNEL COMPENSATION,DETAIL,   ,   ,   ,HERRLE CYNTHIA A.,2018-07-01,2018-09-30,ASST TO THE SPEAKER FOR POLICY,42000,2018
,2018 OFFICE OF THE SPEAKER,Q3,GENERAL EXPENDITURES,PERSONNEL COMPENSATION,DETAIL,   ,   ,   ,HIGGINS CASEY,2018-07-01,2018-09-30,ASSIST TO SPEAKER FOR POLICY,39603.75,2018
,2018 OFFICE OF THE SPEAKER,Q3,GENERAL EXPENDITURES,PERSONNEL COMPENSATION,DETAIL,   ,   ,   ,KEARNEY EMILY M,2018-07-01,2018-09-07,SPECIAL EVENTS SCHEDULING ASST,8375,2018
,2018 OFFICE OF THE SPEAKER,Q3,GENERAL EXPENDITURES,PERSONNEL COMPENSATION,DETAIL,   ,   ,   ,KEARNEY EMILY M,2018-09-08,2018-09-30,DIR SPEC EVENTS/PROTOCOL,5111.11,2018
,2018 OFFICE OF THE SPEAKER,Q3,GENERAL EXPENDITURES,PERSONNEL COMPENSATION,DETAIL,   ,   ,   ,KEARNEY EMILY M,2018-05-01,2018-05-31,SPECIAL EVENTS SCHEDULING ASST (OVERTIME),605.76,2018
,2018 OFFICE OF THE SPEAKER,Q3,GENERAL EXPENDITURES,PERSONNEL COMPENSATION,DETAIL,   ,   ,   ,KOHLER JOHN D,2018-07-01,2018-09-30,CORRESPONDENCE ASSISTANT,6249.99,2018
,2018 OFFICE OF THE SPEAKER,Q3,GENERAL EXPENDITURES,PERSONNEL COMPENSATION,DETAIL,   ,   ,   ,KOHLER JOHN D,2018-07-01,2018-07-31,CORRESPONDENCE ASSISTANT (OVERTIME),144.23,2018
,2018 OFFICE OF THE SPEAKER,Q3,GENERAL EXPENDITURES,PERSONNEL COMPENSATION,DETAIL,   ,   ,   ,LETSCH ANDREW D,2018-07-01,2018-08-20,STAFF ASSISTANT,5555.55,2018
,2018 OFFICE OF THE SPEAKER,Q3,GENERAL EXPENDITURES,PERSONNEL COMPENSATION,DETAIL,   ,   ,   ,LETSCH ANDREW D,2018-08-21,2018-09-30,SPECIAL ASST TO THE SPEAKER,5555.56,2018
,2018 OFFICE OF THE SPEAKER,Q3,GENERAL EXPENDITURES,PERSONNEL COMPENSATION,DETAIL,   ,   ,   ,LETSCH ANDREW D,2018-05-01,2018-07-31,STAFF ASSISTANT (OVERTIME),997.89,2018
,2018 OFFICE OF THE SPEAKER,Q3,GENERAL EXPENDITURES,PERSONNEL COMPENSATION,DETAIL,   ,   ,   ,MANECKE KIMBERLY,2018-07-01,2018-09-07,DEPUTY DIRECTOR OF SCHEDULING,11538.9,2018
,2018 OFFICE OF THE SPEAKER,Q3,GENERAL EXPENDITURES,PERSONNEL COMPENSATION,DETAIL,   ,   ,   ,MANECKE KIMBERLY,2018-09-08,2018-09-30,DEPUTY DIRECTOR OF SCHEDULING/,4536.11,2018
,2018 OFFICE OF THE SPEAKER,Q3,GENERAL EXPENDITURES,PERSONNEL COMPENSATION,DETAIL,   ,   ,   ,MCCANN EDWARD D.,2018-07-01,2018-08-03,ASSIST TO SPEAKER FOR POLICY,14945.34,2018
,2018 OFFICE OF THE SPEAKER,Q3,GENERAL EXPENDITURES,PERSONNEL COMPENSATION,DETAIL,   ,   ,   ,MCCANN EDWARD D.,2018-08-01,2018-08-03,ASSIST TO SPEAKER FOR POLICY (OTHER COMPENSATION),6793.33,2018
,2018 OFFICE OF THE SPEAKER,Q3,GENERAL EXPENDITURES,PERSONNEL COMPENSATION,DETAIL,   ,   ,   ,MILLER WILLIAM,2018-07-01,2018-08-20,SPECIAL ASSISTANT TO THE SPEAK,10756.11,2018
,2018 OFFICE OF THE SPEAKER,Q3,GENERAL EXPENDITURES,PERSONNEL COMPENSATION,DETAIL,   ,   ,   ,MUNDAY J M.,2018-07-01,2018-09-30,DIRECTOR OF INFORMATION TECHNO,38212.5,2018
,2018 OFFICE OF THE SPEAKER,Q3,GENERAL EXPENDITURES,PERSONNEL COMPENSATION,DETAIL,   ,   ,   ,O'TOOLE RYAN T,2018-06-01,2018-09-30,CLOAKROOM DIRECTOR,20458.34,2018
,2018 OFFICE OF THE SPEAKER,Q3,GENERAL EXPENDITURES,PERSONNEL COMPENSATION,DETAIL,   ,   ,   ,PARKS STEPHANIE M,2018-07-01,2018-09-30,ASSISTANT TO SPEAKER FOR POLIC,32499.99,2018
,2018 OFFICE OF THE SPEAKER,Q3,GENERAL EXPENDITURES,PERSONNEL COMPENSATION,DETAIL,   ,   ,   ,POINTER KATHERINE C,2018-06-01,2018-07-15,FLOOR ASSISTANT,2980.55,2018
,2018 OFFICE OF THE SPEAKER,Q3,GENERAL EXPENDITURES,PERSONNEL COMPENSATION,DETAIL,   ,   ,   ,POINTER KATHERINE C,2018-07-16,2018-09-30,DEPUTY FLOOR DIRECTOR,16666.67,2018
,2018 OFFICE OF THE SPEAKER,Q3,GENERAL EXPENDITURES,PERSONNEL COMPENSATION,DETAIL,   ,   ,   ,RICCI MICHAEL,2018-07-01,2018-09-30,DIRECTOR OF COMMUNICATIONS,42102.75,2018
,2018 OFFICE OF THE SPEAKER,Q3,GENERAL EXPENDITURES,PERSONNEL COMPENSATION,DETAIL,   ,   ,   ,RYAN MADELINE E,2018-07-01,2018-09-07,STAFF ASSISTANT,7444.44,2018
,2018 OFFICE OF THE SPEAKER,Q3,GENERAL EXPENDITURES,PERSONNEL COMPENSATION,DETAIL,   ,   ,   ,RYAN MADELINE E,2018-09-08,2018-09-30,DIRECTOR OF ADMIN OPERATIONS,3833.33,2018
,2018 OFFICE OF THE SPEAKER,Q3,GENERAL EXPENDITURES,PERSONNEL COMPENSATION,DETAIL,   ,   ,   ,RYAN MADELINE E,2018-05-01,2018-06-30,STAFF ASSISTANT (OVERTIME),316.4,2018
,2018 OFFICE OF THE SPEAKER,Q3,GENERAL EXPENDITURES,PERSONNEL COMPENSATION,DETAIL,   ,   ,   ,SAKWA JENNA P,2018-07-01,2018-09-30,MEDIA AFFAIRS DIRECTOR,26748.75,2018
,2018 OFFICE OF THE SPEAKER,Q3,GENERAL EXPENDITURES,PERSONNEL COMPENSATION,DETAIL,   ,   ,   ,SMITH CALEB J,2018-07-01,2018-09-30,DIGITAL COMMUNICATIONS DIRECTO,33117.51,2018
,2018 OFFICE OF THE SPEAKER,Q3,GENERAL EXPENDITURES,PERSONNEL COMPENSATION,DETAIL,   ,   ,   ,SMYTHE AUGUSTINE,2018-07-01,2018-09-30,POLICY DIRECTOR,43125,2018
,2018 OFFICE OF THE SPEAKER,Q3,GENERAL EXPENDITURES,PERSONNEL COMPENSATION,DETAIL,   ,   ,   ,SPETH ANDREW D.,2018-07-01,2018-09-30,DEPUTY CHIEF OF STAFF,21000,2018
,2018 OFFICE OF THE SPEAKER,Q3,GENERAL EXPENDITURES,PERSONNEL COMPENSATION,DETAIL,   ,   ,   ,STRONG ASHLEE A,2018-07-01,2018-09-30,PRESS SECRETARY,40712.49,2018
,2018 OFFICE OF THE SPEAKER,Q3,GENERAL EXPENDITURES,PERSONNEL COMPENSATION,DETAIL,   ,   ,   ,VANDEHEY VANESSA P,2018-07-16,2018-09-30,FLOOR ASSISTANT,11458.33,2018
,2018 OFFICE OF THE SPEAKER,Q3,GENERAL EXPENDITURES,PERSONNEL COMPENSATION,DETAIL,   ,   ,   ,WALTZ PAIGE M,2018-07-01,2018-09-30,DIGITAL MEDIA COORDINATOR,16250.01,2018
,2018 OFFICE OF THE SPEAKER,Q3,GENERAL EXPENDITURES,PERSONNEL COMPENSATION,DETAIL,   ,   ,   ,WEAVER KIEL P.,2018-07-01,2018-09-30,ASST TO SPEAKER FOR POLICY,42033.75,2018
,2018 OFFICE OF THE SPEAKER,Q3,GENERAL EXPENDITURES,PERSONNEL COMPENSATION,DETAIL,   ,   ,   ,WICKISER VICTORIA H,2018-07-01,2018-09-30,DIRECTOR OF SCHEDULING,28022.49,2018
,2018 OFFICE OF THE SPEAKER,Q3,GENERAL EXPENDITURES,PERSONNEL COMPENSATION,DETAIL,   ,   ,   ,WRIGHT MIA R,2018-07-01,2018-09-30,STAFF ASSISTANT,8750.01,2018
,2018 OFFICE OF THE SPEAKER,Q3,GENERAL EXPENDITURES,PERSONNEL COMPENSATION,DETAIL,   ,   ,   ,WRIGHT MIA R,2018-05-01,2018-07-31,STAFF ASSISTANT (OVERTIME),176.68,2018
,2018 OFFICE OF THE SPEAKER,Q3,GENERAL EXPENDITURES,PERSONNEL COMPENSATION,SUBTOTAL,   ,   ,   ,   ,   ,   ,PERSONNEL COMPENSATION TOTALS:,1174904.25,2018
,2018 OFFICE OF THE SPEAKER,Q3,GENERAL EXPENDITURES,TRAVEL,DETAIL,2018-07-02,AP,E0636547,WALTZ PAIGE M.,2018-06-14,2018-06-14,TAXI/PARKING/TOLLS,43,2018
,2018 OFFICE OF THE SPEAKER,Q3,GENERAL EXPENDITURES,TRAVEL,DETAIL,2018-07-18,AP,E0641968,EPLEY MARK D.,2018-07-16,2018-07-16,TAXI/PARKING/TOLLS,8,2018
,2018 OFFICE OF THE SPEAKER,Q3,GENERAL EXPENDITURES,TRAVEL,DETAIL,2018-07-27,AP,E0643339,DRESSLER JEFFREY A.,2018-06-20,2018-07-13,TAXI/PARKING/TOLLS,223,2018
,2018 OFFICE OF THE SPEAKER,Q3,GENERAL EXPENDITURES,TRAVEL,DETAIL,2018-08-15,AP,E0646786,CITIBANK GOV CARD SERVICE,2018-07-23,2018-07-27,COMMERCIAL TRANSPORTATION,148.39,2018
,2018 OFFICE OF THE SPEAKER,Q3,GENERAL EXPENDITURES,TRAVEL,DETAIL,2018-08-15,AP,E0646786,CITIBANK GOV CARD SERVICE,2018-07-23,2018-07-27,LODGING,1222.32,2018
,2018 OFFICE OF THE SPEAKER,Q3,GENERAL EXPENDITURES,TRAVEL,DETAIL,2018-08-27,AP,E0650125,KEARNEY EMILY M.,2018-07-23,2018-07-27,MEALS,142.31,2018
,2018 OFFICE OF THE SPEAKER,Q3,GENERAL EXPENDITURES,TRAVEL,DETAIL,2018-08-27,AP,E0650125,KEARNEY EMILY M.,2018-07-23,2018-07-27,TAXI/PARKING/TOLLS,71.41,2018
,2018 OFFICE OF THE SPEAKER,Q3,GENERAL EXPENDITURES,TRAVEL,DETAIL,2018-08-28,AP,E0650466,WALTZ PAIGE M.,2018-07-12,2018-07-12,TAXI/PARKING/TOLLS,25,2018
,2018 OFFICE OF THE SPEAKER,Q3,GENERAL EXPENDITURES,TRAVEL,DETAIL,2018-09-11,AP,E0653181,CITIBANK GOV CARD SERVICE,2018-08-16,2018-08-20,COMMERCIAL TRANSPORTATION,695.6,2018
,2018 OFFICE OF THE SPEAKER,Q3,GENERAL EXPENDITURES,TRAVEL,DETAIL,2018-09-18,AP,E0655510,SMYTHE AUGUSTINE,2018-07-11,2018-07-25,TAXI/PARKING/TOLLS,8.95,2018
,2018 OFFICE OF THE SPEAKER,Q3,GENERAL EXPENDITURES,TRAVEL,DETAIL,2018-09-21,AP,E0656122,DRESSLER JEFFREY A.,2018-07-19,2018-08-06,TAXI/PARKING/TOLLS,72,2018
,2018 OFFICE OF THE SPEAKER,Q3,GENERAL EXPENDITURES,TRAVEL,DETAIL,2018-09-21,AP,E0656122,DRESSLER JEFFREY A.,2018-08-28,2018-09-07,TAXI/PARKING/TOLLS,60,2018
,2018 OFFICE OF THE SPEAKER,Q3,GENERAL EXPENDITURES,TRAVEL,DETAIL,2018-09-25,AP,1018007,WEAVER KIEL P.,2018-08-16,2018-08-20,LODGING,679.96,2018
,2018 OFFICE OF THE SPEAKER,Q3,GENERAL EXPENDITURES,TRAVEL,DETAIL,2018-09-25,AP,1018007,WEAVER KIEL P.,2018-08-16,2018-08-20,TAXI/PARKING/TOLLS,125,2018
,2018 OFFICE OF THE SPEAKER,Q3,GENERAL EXPENDITURES,TRAVEL,SUBTOTAL,   ,   ,   ,   ,   ,   ,TRAVEL TOTALS:,3524.94,2018
,2018 OFFICE OF THE SPEAKER,Q3,GENERAL EXPENDITURES,RENT  COMMUNICATION  UTILITIES,DETAIL,2018-07-26,GL,EMS0080133, ,2018-06-01,2018-06-30,DC TELECOM EQUIP (TRANSFER),164,2018
,2018 OFFICE OF THE SPEAKER,Q3,GENERAL EXPENDITURES,RENT  COMMUNICATION  UTILITIES,DETAIL,2018-07-26,GL,EMS0080133, ,2018-06-01,2018-06-30,DC TELECOM SERV (TRANSFER),956,2018
,2018 OFFICE OF THE SPEAKER,Q3,GENERAL EXPENDITURES,RENT  COMMUNICATION  UTILITIES,DETAIL,2018-07-26,GL,EMS0080133, ,2018-06-01,2018-06-30,DC TELECOM TOLLS (TRANSFER),5420.92,2018
,2018 OFFICE OF THE SPEAKER,Q3,GENERAL EXPENDITURES,RENT  COMMUNICATION  UTILITIES,DETAIL,2018-07-30,AP,E0644373,AT&T,2018-06-10,2018-07-09,TELECOMSRV/EQ/TOLL CHARGE,194.5,2018
,2018 OFFICE OF THE SPEAKER,Q3,GENERAL EXPENDITURES,RENT  COMMUNICATION  UTILITIES,DETAIL,2018-08-25,AP,E0650503,AT&T,2018-07-10,2018-08-09,TELECOMSRV/EQ/TOLL CHARGE,199.67,2018
,2018 OFFICE OF THE SPEAKER,Q3,GENERAL EXPENDITURES,RENT  COMMUNICATION  UTILITIES,DETAIL,2018-08-27,GL,EMS0080878, ,2018-07-01,2018-07-31,DC TELECOM EQUIP (TRANSFER),160,2018
,2018 OFFICE OF THE SPEAKER,Q3,GENERAL EXPENDITURES,RENT  COMMUNICATION  UTILITIES,DETAIL,2018-08-27,GL,EMS0080878, ,2018-07-01,2018-07-31,DC TELECOM SERV (TRANSFER),956,2018
,2018 OFFICE OF THE SPEAKER,Q3,GENERAL EXPENDITURES,RENT  COMMUNICATION  UTILITIES,DETAIL,2018-08-27,GL,EMS0080878, ,2018-07-01,2018-07-31,DC TELECOM TOLLS (TRANSFER),5223.66,2018
,2018 OFFICE OF THE SPEAKER,Q3,GENERAL EXPENDITURES,RENT  COMMUNICATION  UTILITIES,DETAIL,2018-09-25,GL,EMS0081714, ,2018-08-01,2018-08-31,DC TELECOM EQUIP (TRANSFER),156,2018
,2018 OFFICE OF THE SPEAKER,Q3,GENERAL EXPENDITURES,RENT  COMMUNICATION  UTILITIES,DETAIL,2018-09-25,GL,EMS0081714, ,2018-08-01,2018-08-31,DC TELECOM SERV (TRANSFER),956,2018
,2018 OFFICE OF THE SPEAKER,Q3,GENERAL EXPENDITURES,RENT  COMMUNICATION  UTILITIES,DETAIL,2018-09-25,GL,EMS0081714, ,2018-08-01,2018-08-31,DC TELECOM TOLLS (TRANSFER),5317.89,2018
,2018 OFFICE OF THE SPEAKER,Q3,GENERAL EXPENDITURES,RENT  COMMUNICATION  UTILITIES,SUBTOTAL,   ,   ,   ,   ,   ,   ,RENT  COMMUNICATION  UTILITIES TOTALS:,19704.64,2018
,2018 OFFICE OF THE SPEAKER,Q3,GENERAL EXPENDITURES,PRINTING AND REPRODUCTION,DETAIL,2018-07-09,AP,E0639126,ACCURATE WORD LLC,2018-06-29,2018-06-29,PRINTING & REPRODUCTION,59.95,2018
,2018 OFFICE OF THE SPEAKER,Q3,GENERAL EXPENDITURES,PRINTING AND REPRODUCTION,DETAIL,2018-08-02,AP,E0645299,ACCURATE WORD LLC,2018-07-24,2018-07-24,PRINTING & REPRODUCTION,59.95,2018
,2018 OFFICE OF THE SPEAKER,Q3,GENERAL EXPENDITURES,PRINTING AND REPRODUCTION,DETAIL,2018-08-02,AP,E0645304,ACCURATE WORD LLC,2018-07-18,2018-07-18,PRINTING & REPRODUCTION,59.95,2018
,2018 OFFICE OF THE SPEAKER,Q3,GENERAL EXPENDITURES,PRINTING AND REPRODUCTION,DETAIL,2018-09-11,AP,E0653638,ACCURATE WORD LLC,2018-08-27,2018-08-27,PRINTING & REPRODUCTION,59.95,2018
,2018 OFFICE OF THE SPEAKER,Q3,GENERAL EXPENDITURES,PRINTING AND REPRODUCTION,DETAIL,2018-09-15,AP,E0654550,ACCURATE WORD LLC,2018-08-23,2018-08-23,PRINTING & REPRODUCTION,59.95,2018
,2018 OFFICE OF THE SPEAKER,Q3,GENERAL EXPENDITURES,PRINTING AND REPRODUCTION,DETAIL,2018-09-20,AP,E0656099,ACCURATE WORD LLC,2018-09-12,2018-09-12,PRINTING & REPRODUCTION,119.9,2018
,2018 OFFICE OF THE SPEAKER,Q3,GENERAL EXPENDITURES,PRINTING AND REPRODUCTION,DETAIL,2018-09-25,GL,PIX0081715, ,2018-09-01,2018-09-30,PHOTOGRAPHIC (TRANSFER),16,2018
,2018 OFFICE OF THE SPEAKER,Q3,GENERAL EXPENDITURES,PRINTING AND REPRODUCTION,SUBTOTAL,   ,   ,   ,   ,   ,   ,PRINTING AND REPRODUCTION TOTALS:,435.65,2018
,2018 OFFICE OF THE SPEAKER,Q3,GENERAL EXPENDITURES,OTHER SERVICES,DETAIL,2018-07-11,AP,E0638897,ZIGNAL LABS INC,2018-08-01,2018-08-31,WEB DEV HST EMAIL & RLTD SERV,1250,2018
,2018 OFFICE OF THE SPEAKER,Q3,GENERAL EXPENDITURES,OTHER SERVICES,DETAIL,2018-07-16,AP,1001320,LEIDOS DIGITAL SOLUTIONS INC,2018-07-01,2018-07-31,TECHNOLOGY SERVICE CONTRACTS,1860,2018
,2018 OFFICE OF THE SPEAKER,Q3,GENERAL EXPENDITURES,OTHER SERVICES,DETAIL,2018-07-19,AP,1004523,CITI PCARD-MAILCHIMP    MONTHLY,2018-05-29,2018-06-28,WEB DEV HST EMAIL & RLTD SERV,2079.95,2018
,2018 OFFICE OF THE SPEAKER,Q3,GENERAL EXPENDITURES,OTHER SERVICES,DETAIL,2018-07-19,AP,1004523,CITI PCARD-PREMIUMBEAT.COM,2018-05-29,2018-06-28,WEB DEV HST EMAIL & RLTD SERV,49,2018
,2018 OFFICE OF THE SPEAKER,Q3,GENERAL EXPENDITURES,OTHER SERVICES,DETAIL,2018-07-19,AP,1004523,CITI PCARD-SPROUT SOCIAL,2018-05-29,2018-06-28,WEB DEV HST EMAIL & RLTD SERV,59,2018
,2018 OFFICE OF THE SPEAKER,Q3,GENERAL EXPENDITURES,OTHER SERVICES,DETAIL,2018-08-01,AP,1005115,FIRESIDE21,2018-06-01,2018-06-30,WEB DEV HST EMAIL & RLTD SERV,350,2018
,2018 OFFICE OF THE SPEAKER,Q3,GENERAL EXPENDITURES,OTHER SERVICES,DETAIL,2018-08-15,AP,E0646089,KEARNEY EMILY M.,2018-07-23,2018-07-26,TRAINING,995,2018
,2018 OFFICE OF THE SPEAKER,Q3,GENERAL EXPENDITURES,OTHER SERVICES,DETAIL,2018-08-16,AP,1009743,LEIDOS DIGITAL SOLUTIONS INC,2018-08-01,2018-08-31,TECHNOLOGY SERVICE CONTRACTS,1860,2018
,2018 OFFICE OF THE SPEAKER,Q3,GENERAL EXPENDITURES,OTHER SERVICES,DETAIL,2018-08-17,AP,1010486,CITI PCARD-MAILCHIMP    MONTHLY,2018-06-29,2018-07-27,WEB DEV HST EMAIL & RLTD SERV,2079.95,2018
,2018 OFFICE OF THE SPEAKER,Q3,GENERAL EXPENDITURES,OTHER SERVICES,DETAIL,2018-08-17,AP,1010486,CITI PCARD-SPROUT SOCIAL INC,2018-06-29,2018-07-27,WEB DEV HST EMAIL & RLTD SERV,59,2018
,2018 OFFICE OF THE SPEAKER,Q3,GENERAL EXPENDITURES,OTHER SERVICES,DETAIL,2018-08-28,AP,E0650466,WALTZ PAIGE M.,2018-07-23,2018-07-23,WEB DEV HST EMAIL & RLTD SERV,49,2018
,2018 OFFICE OF THE SPEAKER,Q3,GENERAL EXPENDITURES,OTHER SERVICES,DETAIL,2018-08-31,AP,1011726,FIRESIDE21,2018-07-01,2018-07-31,WEB DEV HST EMAIL & RLTD SERV,350,2018
,2018 OFFICE OF THE SPEAKER,Q3,GENERAL EXPENDITURES,OTHER SERVICES,DETAIL,2018-09-16,AP,1014674,LEIDOS DIGITAL SOLUTIONS INC,2018-09-01,2018-09-30,TECHNOLOGY SERVICE CONTRACTS,1860,2018
,2018 OFFICE OF THE SPEAKER,Q3,GENERAL EXPENDITURES,OTHER SERVICES,DETAIL,2018-09-18,AP,E0654871,NEW TARGET INC,2018-07-02,2018-07-26,WEB DEV HST EMAIL & RLTD SERV,5035.79,2018
,2018 OFFICE OF THE SPEAKER,Q3,GENERAL EXPENDITURES,OTHER SERVICES,DETAIL,2018-09-18,AP,E0655509,ZIGNAL LABS INC,2018-09-01,2018-09-30,WEB DEV HST EMAIL & RLTD SERV,1250,2018
,2018 OFFICE OF THE SPEAKER,Q3,GENERAL EXPENDITURES,OTHER SERVICES,DETAIL,2018-09-19,AP,E0655539,NEW TARGET INC,2018-08-01,2018-08-31,WEB DEV HST EMAIL & RLTD SERV,1258.96,2018
,2018 OFFICE OF THE SPEAKER,Q3,GENERAL EXPENDITURES,OTHER SERVICES,DETAIL,2018-09-20,AP,E0654547,ZIGNAL LABS INC,2018-10-01,2018-10-31,WEB DEV HST EMAIL & RLTD SERV,1250,2018
,2018 OFFICE OF THE SPEAKER,Q3,GENERAL EXPENDITURES,OTHER SERVICES,DETAIL,2018-09-26,AP,1019131,CITI PCARD-MAILCHIMP    MONTHLY,2018-07-28,2018-08-28,WEB DEV HST EMAIL & RLTD SERV,2079.95,2018
,2018 OFFICE OF THE SPEAKER,Q3,GENERAL EXPENDITURES,OTHER SERVICES,DETAIL,2018-09-26,AP,1019131,CITI PCARD-SPROUT SOCIAL INC,2018-07-28,2018-08-28,WEB DEV HST EMAIL & RLTD SERV,59,2018
,2018 OFFICE OF THE SPEAKER,Q3,GENERAL EXPENDITURES,OTHER SERVICES,SUBTOTAL,   ,   ,   ,   ,   ,   ,OTHER SERVICES TOTALS:,23834.6,2018
,2018 OFFICE OF THE SPEAKER,Q3,GENERAL EXPENDITURES,SUPPLIES AND MATERIALS,DETAIL,2018-07-06,AP,E0638562,COCA-COLA BOTTLING COMPANY CONSOLIDATED,2018-06-29,2018-06-29,FOOD & BEVERAGE,66.42,2018
,2018 OFFICE OF THE SPEAKER,Q3,GENERAL EXPENDITURES,SUPPLIES AND MATERIALS,DETAIL,2018-07-09,AP,E0638260,FIRST CHOICE COFFEE SERVICES,2018-06-28,2018-06-28,FOOD & BEVERAGE,741.16,2018
,2018 OFFICE OF THE SPEAKER,Q3,GENERAL EXPENDITURES,SUPPLIES AND MATERIALS,DETAIL,2018-07-09,AP,E0638260,FIRST CHOICE COFFEE SERVICES,2018-06-28,2018-06-28,OFFICE SUPPLIES (OUTSIDE),117.52,2018
,2018 OFFICE OF THE SPEAKER,Q3,GENERAL EXPENDITURES,SUPPLIES AND MATERIALS,DETAIL,2018-07-16,AP,E0639764,EASBY-SMITH ANNE S.,2018-06-26,2018-06-26,FOOD & BEVERAGE,19.03,2018
,2018 OFFICE OF THE SPEAKER,Q3,GENERAL EXPENDITURES,SUPPLIES AND MATERIALS,DETAIL,2018-07-19,AP,1004523,CITI PCARD-ADOBE  CREATIVE CLOUD,2018-05-29,2018-06-28,SOFTWARE  LESS THAN  $500,148.03,2018
,2018 OFFICE OF THE SPEAKER,Q3,GENERAL EXPENDITURES,SUPPLIES AND MATERIALS,DETAIL,2018-07-19,AP,1004523,CITI PCARD-AMAZON MKTPLACE PMTS,2018-05-29,2018-06-28,OFFICE SUPPLIES (OUTSIDE),50.97,2018