BIOGUIDE_ID,OFFICE,QUARTER,PROGRAM,CATEGORY,SORT SEQUENCE,DATE,TRANSCODE,RECORDID,PAYEE,START DATE,END DATE,PURPOSE,AMOUNT,YEAR
,2020 OFFICE OF THE SPEAKER,3,GENERAL EXPENDITURES,PERSONNEL COMPENSATION,DETAIL,   ,   ,   ,BERRET EMILY C,2020-07-01,2020-09-30,DIR OF OPERATIONS & ADVISOR,36741.67,2020
,2020 OFFICE OF THE SPEAKER,3,GENERAL EXPENDITURES,PERSONNEL COMPENSATION,DETAIL,   ,   ,   ,BUSH JACQUELINE D,2020-07-01,2020-09-30,DIGITAL ASSISTANT,8124.99,2020
,2020 OFFICE OF THE SPEAKER,3,GENERAL EXPENDITURES,PERSONNEL COMPENSATION,DETAIL,   ,   ,   ,CAPRON MARGARET W.,2020-07-01,2020-09-30,SENIOR ADV FOR POLICY & COMM,38274.51,2020
,2020 OFFICE OF THE SPEAKER,3,GENERAL EXPENDITURES,PERSONNEL COMPENSATION,DETAIL,   ,   ,   ,CHERRY STEPHANIE,2020-07-01,2020-09-30,DIRECTOR OF MEDIA AFFAIRS,26500,2020
,2020 OFFICE OF THE SPEAKER,3,GENERAL EXPENDITURES,PERSONNEL COMPENSATION,DETAIL,   ,   ,   ,CONNELLY HENRY V,2020-07-01,2020-09-30,DEPUTY COMMUNICATIONS DIRECTOR,36991.67,2020
,2020 OFFICE OF THE SPEAKER,3,GENERAL EXPENDITURES,PERSONNEL COMPENSATION,DETAIL,   ,   ,   ,COSTELLO JOSEPH M,2020-07-01,2020-09-30,PRESS ASSISTANT,12124.99,2020
,2020 OFFICE OF THE SPEAKER,3,GENERAL EXPENDITURES,PERSONNEL COMPENSATION,DETAIL,   ,   ,   ,COSTELLO JOSEPH M,2020-06-01,2020-08-01,PRESS ASSISTANT (OVERTIME),6451.09,2020
,2020 OFFICE OF THE SPEAKER,3,GENERAL EXPENDITURES,PERSONNEL COMPENSATION,DETAIL,   ,   ,   ,DEGRAFF KENNETH B.,2020-07-01,2020-09-30,SENIOR POLICY ADVISOR,35250.01,2020
,2020 OFFICE OF THE SPEAKER,3,GENERAL EXPENDITURES,PERSONNEL COMPENSATION,DETAIL,   ,   ,   ,DEWHIRST DIANE,2020-07-01,2020-09-30,DEPUTY CHIEF OF STAFF,43475.01,2020
,2020 OFFICE OF THE SPEAKER,3,GENERAL EXPENDITURES,PERSONNEL COMPENSATION,DETAIL,   ,   ,   ,DILLON KRISTEN G,2020-07-01,2020-09-30,POLICY ADVISOR,300,2020
,2020 OFFICE OF THE SPEAKER,3,GENERAL EXPENDITURES,PERSONNEL COMPENSATION,DETAIL,   ,   ,   ,DONOHUE JENNIFER A,2020-07-01,2020-09-30,EXECUTIVE DIRECTOR,41250,2020
,2020 OFFICE OF THE SPEAKER,3,GENERAL EXPENDITURES,PERSONNEL COMPENSATION,DETAIL,   ,   ,   ,EDMONSON ROBERT D,2020-07-01,2020-09-30,POLICY ADVISOR,20141.67,2020
,2020 OFFICE OF THE SPEAKER,3,GENERAL EXPENDITURES,PERSONNEL COMPENSATION,DETAIL,   ,   ,   ,EHRENBERG MIA R,2020-07-01,2020-08-31,PRESS ADVISOR,3111.11,2020
,2020 OFFICE OF THE SPEAKER,3,GENERAL EXPENDITURES,PERSONNEL COMPENSATION,DETAIL,   ,   ,   ,EHRENBERG MIA R,2020-06-01,2020-07-31,PRESS ADVISOR (OVERTIME),4486.43,2020
,2020 OFFICE OF THE SPEAKER,3,GENERAL EXPENDITURES,PERSONNEL COMPENSATION,DETAIL,   ,   ,   ,ETIENNE ASHLEY D,2020-07-01,2020-08-06,COMM DIR/SENIOR ADVISOR,17390,2020
,2020 OFFICE OF THE SPEAKER,3,GENERAL EXPENDITURES,PERSONNEL COMPENSATION,DETAIL,   ,   ,   ,ETIENNE ASHLEY D,2020-08-01,2020-08-06,COMM DIR/SENIOR ADVISOR (OTHER COMPENSATION),11593.33,2020
,2020 OFFICE OF THE SPEAKER,3,GENERAL EXPENDITURES,PERSONNEL COMPENSATION,DETAIL,   ,   ,   ,FINNEY FELICIA V,2020-07-01,2020-09-30,STAFF ASSISTANT,13124.99,2020
,2020 OFFICE OF THE SPEAKER,3,GENERAL EXPENDITURES,PERSONNEL COMPENSATION,DETAIL,   ,   ,   ,FINNEY FELICIA V,2020-06-01,2020-08-01,STAFF ASSISTANT (OVERTIME),2463.08,2020
,2020 OFFICE OF THE SPEAKER,3,GENERAL EXPENDITURES,PERSONNEL COMPENSATION,DETAIL,   ,   ,   ,FISCHER JR ROBERT V.,2020-07-01,2020-09-30,ASST FLOOR CHIEF,43475.01,2020
,2020 OFFICE OF THE SPEAKER,3,GENERAL EXPENDITURES,PERSONNEL COMPENSATION,DETAIL,   ,   ,   ,FLEET II JAMES P,2020-07-01,2020-09-30,SENIOR ADVISOR,300,2020
,2020 OFFICE OF THE SPEAKER,3,GENERAL EXPENDITURES,PERSONNEL COMPENSATION,DETAIL,   ,   ,   ,GARCIA MONICA,2020-08-01,2020-09-30,COMMUNICATIONS DIRECTOR,11333.34,2020
,2020 OFFICE OF THE SPEAKER,3,GENERAL EXPENDITURES,PERSONNEL COMPENSATION,DETAIL,   ,   ,   ,GIBSON DYLAN B,2020-07-01,2020-09-30,DIGITAL DIRECTOR,20250.01,2020
,2020 OFFICE OF THE SPEAKER,3,GENERAL EXPENDITURES,PERSONNEL COMPENSATION,DETAIL,   ,   ,   ,GREENER APRIL L.,2020-07-01,2020-09-30,RESEARCH DIRECTOR,32250.01,2020
,2020 OFFICE OF THE SPEAKER,3,GENERAL EXPENDITURES,PERSONNEL COMPENSATION,DETAIL,   ,   ,   ,HAMMILL ANDREW T.,2020-07-01,2020-09-30,DEPUTY CHIEF OF STAFF,43475.01,2020
,2020 OFFICE OF THE SPEAKER,3,GENERAL EXPENDITURES,PERSONNEL COMPENSATION,DETAIL,   ,   ,   ,HAN LEAH J.,2020-07-27,2020-09-30,STAFF ASSISTANT,9777.77,2020
,2020 OFFICE OF THE SPEAKER,3,GENERAL EXPENDITURES,PERSONNEL COMPENSATION,DETAIL,   ,   ,   ,HAN LEAH J.,2020-07-27,2020-08-01,STAFF ASSISTANT (OVERTIME),433.59,2020
,2020 OFFICE OF THE SPEAKER,3,GENERAL EXPENDITURES,PERSONNEL COMPENSATION,DETAIL,   ,   ,   ,HAYNES JR WILFRED J.,2020-07-01,2020-09-30,IT DIRECTOR,32280.5,2020
,2020 OFFICE OF THE SPEAKER,3,GENERAL EXPENDITURES,PERSONNEL COMPENSATION,DETAIL,   ,   ,   ,HIDALGO ADRIANA N,2020-07-01,2020-09-30,DISTRICT SCHED/SPECIAL ASSIST,18166.67,2020
,2020 OFFICE OF THE SPEAKER,3,GENERAL EXPENDITURES,PERSONNEL COMPENSATION,DETAIL,   ,   ,   ,HOLMES NATHANIEL J,2020-07-01,2020-09-30,DEP DIR/SCHEDULING & ADVANCE,22249.99,2020
,2020 OFFICE OF THE SPEAKER,3,GENERAL EXPENDITURES,PERSONNEL COMPENSATION,DETAIL,   ,   ,   ,HURWITZ ROSS B,2020-07-01,2020-09-30,DEPUTY DIR. OF SPEECHWRITING,20250.01,2020
,2020 OFFICE OF THE SPEAKER,3,GENERAL EXPENDITURES,PERSONNEL COMPENSATION,DETAIL,   ,   ,   ,IACOBELLIS SAMUEL C,2020-07-01,2020-09-30,MBR SVC & INTERGOV AFFAIRS ADV,16624.99,2020
,2020 OFFICE OF THE SPEAKER,3,GENERAL EXPENDITURES,PERSONNEL COMPENSATION,DETAIL,   ,   ,   ,JACKSON AUDRA L,2020-07-01,2020-09-30,ASST MGR FOR THE DEM CLOAKROOM,21499.99,2020
,2020 OFFICE OF THE SPEAKER,3,GENERAL EXPENDITURES,PERSONNEL COMPENSATION,DETAIL,   ,   ,   ,JETER KRISTINA B,2020-07-01,2020-09-30,DPTY DIR/SPEC EVENT & PROTOCOL,25666.67,2020
,2020 OFFICE OF THE SPEAKER,3,GENERAL EXPENDITURES,PERSONNEL COMPENSATION,DETAIL,   ,   ,   ,JONES MEREDITH A,2020-07-01,2020-09-30,SENIOR ADVISOR,41250,2020
,2020 OFFICE OF THE SPEAKER,3,GENERAL EXPENDITURES,PERSONNEL COMPENSATION,DETAIL,   ,   ,   ,KAPLAN EMMA L,2020-07-01,2020-09-30,FLOOR ADVISOR,24000.01,2020
,2020 OFFICE OF THE SPEAKER,3,GENERAL EXPENDITURES,PERSONNEL COMPENSATION,DETAIL,   ,   ,   ,KEATING ROSE M,2020-07-01,2020-09-30,ASST FLOOR MANAGER,36158.33,2020
,2020 OFFICE OF THE SPEAKER,3,GENERAL EXPENDITURES,PERSONNEL COMPENSATION,DETAIL,   ,   ,   ,KEITA KAMILAH Z,2020-07-01,2020-09-30,DEPUTY INFOMATION TECH. DIRECT,29916.34,2020
,2020 OFFICE OF THE SPEAKER,3,GENERAL EXPENDITURES,PERSONNEL COMPENSATION,DETAIL,   ,   ,   ,KUNDANIS GEORGE,2020-07-01,2020-09-30,DEPUTY CHIEF OF STAFF,43475.01,2020
,2020 OFFICE OF THE SPEAKER,3,GENERAL EXPENDITURES,PERSONNEL COMPENSATION,DETAIL,   ,   ,   ,LA ALISA M,2020-07-01,2020-09-30,SPECIAL ASST TO THE SPEAKER,26083.33,2020
,2020 OFFICE OF THE SPEAKER,3,GENERAL EXPENDITURES,PERSONNEL COMPENSATION,DETAIL,   ,   ,   ,LEE SERYEUNG,2020-07-01,2020-08-31,DEPUTY PRESS SECRETARY,10875,2020
,2020 OFFICE OF THE SPEAKER,3,GENERAL EXPENDITURES,PERSONNEL COMPENSATION,DETAIL,   ,   ,   ,LEE SERYEUNG,2020-09-01,2020-09-30,PRESS SECRETARY,10666.67,2020
,2020 OFFICE OF THE SPEAKER,3,GENERAL EXPENDITURES,PERSONNEL COMPENSATION,DETAIL,   ,   ,   ,LIZARRAGA JAIME E.,2020-07-01,2020-09-30,SENIOR ADVISOR,43475.01,2020
,2020 OFFICE OF THE SPEAKER,3,GENERAL EXPENDITURES,PERSONNEL COMPENSATION,DETAIL,   ,   ,   ,LONG MICHAEL G,2020-07-01,2020-09-30,SR ADV & DIR OF MBR SERV,36158.33,2020
,2020 OFFICE OF THE SPEAKER,3,GENERAL EXPENDITURES,PERSONNEL COMPENSATION,DETAIL,   ,   ,   ,MANGRUM PEARL J.,2020-07-01,2020-09-30,FINANCIAL ADMINISTRATOR,35391.55,2020
,2020 OFFICE OF THE SPEAKER,3,GENERAL EXPENDITURES,PERSONNEL COMPENSATION,DETAIL,   ,   ,   ,MANSBACH SHANA G,2020-07-01,2020-09-30,DIRECTOR OF SPEECHWRITING,28999.99,2020
,2020 OFFICE OF THE SPEAKER,3,GENERAL EXPENDITURES,PERSONNEL COMPENSATION,DETAIL,   ,   ,   ,MARRON BRENNA K,2020-07-01,2020-09-30,DEPUTY EXEC DIRECTOR,28749.99,2020
,2020 OFFICE OF THE SPEAKER,3,GENERAL EXPENDITURES,PERSONNEL COMPENSATION,DETAIL,   ,   ,   ,MASON GRAHAM H,2020-07-01,2020-09-30,SENIOR ADVISOR,30416.67,2020
,2020 OFFICE OF THE SPEAKER,3,GENERAL EXPENDITURES,PERSONNEL COMPENSATION,DETAIL,   ,   ,   ,MCCULLOUGH MARY T,2020-07-01,2020-09-30,CHIEF OF STAFF,43475.01,2020
,2020 OFFICE OF THE SPEAKER,3,GENERAL EXPENDITURES,PERSONNEL COMPENSATION,DETAIL,   ,   ,   ,MCCULLOUGH WILLIAM J,2020-07-01,2020-09-30,PRESS ASSISTANT,12124.99,2020
,2020 OFFICE OF THE SPEAKER,3,GENERAL EXPENDITURES,PERSONNEL COMPENSATION,DETAIL,   ,   ,   ,MCCULLOUGH WILLIAM J,2020-06-01,2020-08-01,PRESS ASSISTANT (OVERTIME),5906.19,2020
,2020 OFFICE OF THE SPEAKER,3,GENERAL EXPENDITURES,PERSONNEL COMPENSATION,DETAIL,   ,   ,   ,MELTZER RICHARD,2020-07-01,2020-09-30,POLICY DIRECTOR,43475.01,2020
,2020 OFFICE OF THE SPEAKER,3,GENERAL EXPENDITURES,PERSONNEL COMPENSATION,DETAIL,   ,   ,   ,MILLER MONTANA R,2020-07-01,2020-09-30,DEPUTY DIRECTOR OF SCHEDULING,19999.99,2020
,2020 OFFICE OF THE SPEAKER,3,GENERAL EXPENDITURES,PERSONNEL COMPENSATION,DETAIL,   ,   ,   ,MONGE KATHERINE S,2020-07-01,2020-09-30,SENIOR COUNSEL,43475.01,2020
,2020 OFFICE OF THE SPEAKER,3,GENERAL EXPENDITURES,PERSONNEL COMPENSATION,DETAIL,   ,   ,   ,MONTES DAVID,2020-07-01,2020-07-31,SENIOR ADVISOR,10000,2020
,2020 OFFICE OF THE SPEAKER,3,GENERAL EXPENDITURES,PERSONNEL COMPENSATION,DETAIL,   ,   ,   ,OBSCURA JULIO C,2020-07-01,2020-08-31,CREATIVE DIRECTOR,19465.27,2020
,2020 OFFICE OF THE SPEAKER,3,GENERAL EXPENDITURES,PERSONNEL COMPENSATION,DETAIL,   ,   ,   ,OBSCURA JULIO C,2020-09-01,2020-09-25,CREATIVE DIRECTOR (OTHER COMPENSATION),5458.33,2020
,2020 OFFICE OF THE SPEAKER,3,GENERAL EXPENDITURES,PERSONNEL COMPENSATION,DETAIL,   ,   ,   ,PARKER WYNDEE R.,2020-07-01,2020-09-30,NATIONAL SECURITY ADVISOR,43475.01,2020
,2020 OFFICE OF THE SPEAKER,3,GENERAL EXPENDITURES,PERSONNEL COMPENSATION,DETAIL,   ,   ,   ,POWELL LATRICE S,2020-07-01,2020-09-30,DEPUTY FLOOR DIRECTOR,37825.01,2020
,2020 OFFICE OF THE SPEAKER,3,GENERAL EXPENDITURES,PERSONNEL COMPENSATION,DETAIL,   ,   ,   ,PRICE REVA B.,2020-07-01,2020-09-30,OUTREACH DIR & SENIOR ADVISOR,38608.01,2020
,2020 OFFICE OF THE SPEAKER,3,GENERAL EXPENDITURES,PERSONNEL COMPENSATION,DETAIL,   ,   ,   ,PRIMUS WENDELL E.,2020-07-01,2020-09-30,SR HLTH/BUDGET POLICY ADV,43475.01,2020
,2020 OFFICE OF THE SPEAKER,3,GENERAL EXPENDITURES,PERSONNEL COMPENSATION,DETAIL,   ,   ,   ,RAMIREZ ANGELA K.,2020-07-01,2020-07-14,SENIOR ADVISOR,2173.89,2020
,2020 OFFICE OF THE SPEAKER,3,GENERAL EXPENDITURES,PERSONNEL COMPENSATION,DETAIL,   ,   ,   ,RAMIREZ MATTHEW M,2020-07-01,2020-09-30,OUTREACH ADVISOR,17125,2020
,2020 OFFICE OF THE SPEAKER,3,GENERAL EXPENDITURES,PERSONNEL COMPENSATION,DETAIL,   ,   ,   ,ROBLES CLARISSA V,2020-07-01,2020-09-30,MEMBER SERVICES COORDINATOR,12500.01,2020
,2020 OFFICE OF THE SPEAKER,3,GENERAL EXPENDITURES,PERSONNEL COMPENSATION,DETAIL,   ,   ,   ,ROSS PATRICIA L,2020-07-01,2020-09-30,SENIOR POLICY ADVISOR,25416.67,2020
,2020 OFFICE OF THE SPEAKER,3,GENERAL EXPENDITURES,PERSONNEL COMPENSATION,DETAIL,   ,   ,   ,RUSSELL MAYA A,2020-09-07,2020-09-30,DIGITAL DIRECTOR,3666.67,2020
,2020 OFFICE OF THE SPEAKER,3,GENERAL EXPENDITURES,PERSONNEL COMPENSATION,DETAIL,   ,   ,   ,SANCHEZ CARLOS S.,2020-07-24,2020-09-30,SENIOR ADVISOR,30794.44,2020
,2020 OFFICE OF THE SPEAKER,3,GENERAL EXPENDITURES,PERSONNEL COMPENSATION,DETAIL,   ,   ,   ,SMITH KELSEY L,2020-07-01,2020-09-30,DIR. OF SCHEDULING & ADVANCE,36158.33,2020
,2020 OFFICE OF THE SPEAKER,3,GENERAL EXPENDITURES,PERSONNEL COMPENSATION,DETAIL,   ,   ,   ,SMITH SHANE T,2020-07-01,2020-09-30,DPTY DIR OF ADVANCE/TRIP COORD,21499.99,2020
,2020 OFFICE OF THE SPEAKER,3,GENERAL EXPENDITURES,PERSONNEL COMPENSATION,DETAIL,   ,   ,   ,STERN KEITH L.,2020-07-01,2020-09-30,DIRECTOR OF FLOOR OPERATIONS,43475.01,2020
,2020 OFFICE OF THE SPEAKER,3,GENERAL EXPENDITURES,PERSONNEL COMPENSATION,DETAIL,   ,   ,   ,SWIG SARAH B,2020-07-01,2020-09-30,POLICY ASSOCIATE,17125,2020
,2020 OFFICE OF THE SPEAKER,3,GENERAL EXPENDITURES,PERSONNEL COMPENSATION,DETAIL,   ,   ,   ,TECKLENBURG MICHAEL H.,2020-07-01,2020-09-30,COUNSEL,38158.33,2020
,2020 OFFICE OF THE SPEAKER,3,GENERAL EXPENDITURES,PERSONNEL COMPENSATION,DETAIL,   ,   ,   ,URRY ALEXANDER M,2020-07-01,2020-09-30,POLICY ADVISOR,17749.99,2020
,2020 OFFICE OF THE SPEAKER,3,GENERAL EXPENDITURES,PERSONNEL COMPENSATION,DETAIL,   ,   ,   ,WEST JULIUS L,2020-07-01,2020-07-01,SENIOR ADVISOR,254.17,2020
,2020 OFFICE OF THE SPEAKER,3,GENERAL EXPENDITURES,PERSONNEL COMPENSATION,DETAIL,   ,   ,   ,WEST JULIUS L,2020-07-01,2020-07-01,SENIOR ADVISOR (OTHER COMPENSATION),7370.83,2020
,2020 OFFICE OF THE SPEAKER,3,GENERAL EXPENDITURES,PERSONNEL COMPENSATION,DETAIL,   ,   ,   ,WOLFF CELINE K.,2020-07-01,2020-09-30,DEPUTY DIGITAL DIRECTOR,13375,2020
,2020 OFFICE OF THE SPEAKER,3,GENERAL EXPENDITURES,PERSONNEL COMPENSATION,DETAIL,   ,   ,   ,WOLFF CELINE K.,2020-07-01,2020-08-01,DEPUTY DIGITAL DIRECTOR (OVERTIME),1561.73,2020
,2020 OFFICE OF THE SPEAKER,3,GENERAL EXPENDITURES,PERSONNEL COMPENSATION,DETAIL,   ,   ,   ,WOLTERS KATE,2020-07-01,2020-09-30,DIRECTOR OF SPECIAL EVENTS,28149.99,2020
,2020 OFFICE OF THE SPEAKER,3,GENERAL EXPENDITURES,PERSONNEL COMPENSATION,DETAIL,   ,   ,   ,WONG STEPHANIE P,2020-07-01,2020-07-01,SPECIAL ASSIST TO THE EXEC OFC,168.06,2020
,2020 OFFICE OF THE SPEAKER,3,GENERAL EXPENDITURES,PERSONNEL COMPENSATION,DETAIL,   ,   ,   ,WONG STEPHANIE P,2020-07-01,2020-07-01,SPECIAL ASSIST TO THE EXEC OFC (OTHER COMPENSATION),4873.61,2020
,2020 OFFICE OF THE SPEAKER,3,GENERAL EXPENDITURES,PERSONNEL COMPENSATION,SUBTOTAL,   ,   ,   ,   ,   ,   ,PERSONNEL COMPENSATION TOTALS:,1789803.9,2020
,2020 OFFICE OF THE SPEAKER,3,GENERAL EXPENDITURES,TRAVEL,DETAIL,2020-07-23,AP,1315744,FINNEY FELICIA V.,2020-04-23,2020-04-23,TAXI/PARKING/TOLLS,20.15,2020
,2020 OFFICE OF THE SPEAKER,3,GENERAL EXPENDITURES,TRAVEL,DETAIL,2020-07-23,AP,1315744,FINNEY FELICIA V.,2020-05-07,2020-05-27,TAXI/PARKING/TOLLS,62.71,2020
,2020 OFFICE OF THE SPEAKER,3,GENERAL EXPENDITURES,TRAVEL,DETAIL,2020-07-23,AP,1315744,FINNEY FELICIA V.,2020-06-11,2020-06-11,TAXI/PARKING/TOLLS,23.53,2020
,2020 OFFICE OF THE SPEAKER,3,GENERAL EXPENDITURES,TRAVEL,DETAIL,2020-09-16,AP,1332576,CITIBANK GOV CARD SERVICE,2020-07-28,2020-07-30,LODGING,236.82,2020
,2020 OFFICE OF THE SPEAKER,3,GENERAL EXPENDITURES,TRAVEL,DETAIL,2020-09-16,AP,1332576,CITIBANK GOV CARD SERVICE,2020-07-28,2020-07-28,MEALS,56.36,2020
,2020 OFFICE OF THE SPEAKER,3,GENERAL EXPENDITURES,TRAVEL,DETAIL,2020-09-16,AP,1332576,CITIBANK GOV CARD SERVICE,2020-07-29,2020-07-29,MEALS,44.23,2020
,2020 OFFICE OF THE SPEAKER,3,GENERAL EXPENDITURES,TRAVEL,DETAIL,2020-09-16,AP,1332576,CITIBANK GOV CARD SERVICE,2020-07-28,2020-07-28,TAXI/PARKING/TOLLS,66.74,2020
,2020 OFFICE OF THE SPEAKER,3,GENERAL EXPENDITURES,TRAVEL,DETAIL,2020-09-16,AP,1332576,CITIBANK GOV CARD SERVICE,2020-07-29,2020-07-29,TAXI/PARKING/TOLLS,18.99,2020
,2020 OFFICE OF THE SPEAKER,3,GENERAL EXPENDITURES,TRAVEL,SUBTOTAL,   ,   ,   ,   ,   ,   ,TRAVEL TOTALS:,529.53,2020
,2020 OFFICE OF THE SPEAKER,3,GENERAL EXPENDITURES,RENT  COMMUNICATION  UTILITIES,DETAIL,2020-07-27,GL,MED0099449, ,2020-06-23,2020-07-22,HIR GRAPHICS (TRANSFER),222,2020
,2020 OFFICE OF THE SPEAKER,3,GENERAL EXPENDITURES,RENT  COMMUNICATION  UTILITIES,DETAIL,2020-07-29,GL,EMS0099556, ,2020-06-01,2020-06-30,DC TELECOM EQUIP (TRANSFER),232,2020
,2020 OFFICE OF THE SPEAKER,3,GENERAL EXPENDITURES,RENT  COMMUNICATION  UTILITIES,DETAIL,2020-07-29,GL,EMS0099556, ,2020-06-01,2020-06-30,DC TELECOM SERV (TRANSFER),1227.5,2020
,2020 OFFICE OF THE SPEAKER,3,GENERAL EXPENDITURES,RENT  COMMUNICATION  UTILITIES,DETAIL,2020-07-29,GL,EMS0099556, ,2020-06-01,2020-06-30,DC TELECOM TOLLS (TRANSFER),10643.19,2020
,2020 OFFICE OF THE SPEAKER,3,GENERAL EXPENDITURES,RENT  COMMUNICATION  UTILITIES,DETAIL,2020-08-05,AP,1320214,FEDEX,2020-07-14,2020-07-14,POSTAGE / COURIER / BOX RENTAL,13.57,2020
,2020 OFFICE OF THE SPEAKER,3,GENERAL EXPENDITURES,RENT  COMMUNICATION  UTILITIES,DETAIL,2020-08-26,GL,EMS0100215, ,2020-07-01,2020-07-31,DC TELECOM EQUIP (TRANSFER),232,2020
,2020 OFFICE OF THE SPEAKER,3,GENERAL EXPENDITURES,RENT  COMMUNICATION  UTILITIES,DETAIL,2020-08-26,GL,EMS0100215, ,2020-07-01,2020-07-31,DC TELECOM SERV (TRANSFER),1232.5,2020
,2020 OFFICE OF THE SPEAKER,3,GENERAL EXPENDITURES,RENT  COMMUNICATION  UTILITIES,DETAIL,2020-08-26,GL,EMS0100215, ,2020-07-01,2020-07-31,DC TELECOM TOLLS (TRANSFER),11323.57,2020
,2020 OFFICE OF THE SPEAKER,3,GENERAL EXPENDITURES,RENT  COMMUNICATION  UTILITIES,DETAIL,2020-08-26,GL,MED0100217, ,2020-08-13,2020-08-13,HIR GRAPHICS (TRANSFER),50,2020
,2020 OFFICE OF THE SPEAKER,3,GENERAL EXPENDITURES,RENT  COMMUNICATION  UTILITIES,DETAIL,2020-09-24,GL,MED0100963, ,2020-09-08,2020-09-17,HIR GRAPHICS (TRANSFER),818,2020
,2020 OFFICE OF THE SPEAKER,3,GENERAL EXPENDITURES,RENT  COMMUNICATION  UTILITIES,DETAIL,2020-09-28,GL,EMS0101058, ,2020-08-01,2020-08-31,DC TELECOM EQUIP (TRANSFER),232,2020
,2020 OFFICE OF THE SPEAKER,3,GENERAL EXPENDITURES,RENT  COMMUNICATION  UTILITIES,DETAIL,2020-09-28,GL,EMS0101058, ,2020-08-01,2020-08-31,DC TELECOM SERV (TRANSFER),1232.5,2020
,2020 OFFICE OF THE SPEAKER,3,GENERAL EXPENDITURES,RENT  COMMUNICATION  UTILITIES,DETAIL,2020-09-28,GL,EMS0101058, ,2020-08-01,2020-08-31,DC TELECOM TOLLS (TRANSFER),8063.89,2020
,2020 OFFICE OF THE SPEAKER,3,GENERAL EXPENDITURES,RENT  COMMUNICATION  UTILITIES,SUBTOTAL,   ,   ,   ,   ,   ,   ,RENT  COMMUNICATION  UTILITIES TOTALS:,35522.72,2020
,2020 OFFICE OF THE SPEAKER,3,GENERAL EXPENDITURES,PRINTING AND REPRODUCTION,DETAIL,2020-07-23,AP,1312030,ACCURATE WORD LLC,2020-07-07,2020-07-07,PRINTING & REPRODUCTION,3065,2020
,2020 OFFICE OF THE SPEAKER,3,GENERAL EXPENDITURES,PRINTING AND REPRODUCTION,DETAIL,2020-07-27,GL,MED0099449, ,2020-06-26,2020-07-14,PHOTOGRAPHIC (TRANSFER),75.2,2020
,2020 OFFICE OF THE SPEAKER,3,GENERAL EXPENDITURES,PRINTING AND REPRODUCTION,DETAIL,2020-07-31,AP,1318056,ACCURATE WORD LLC,2020-07-20,2020-07-20,PRINTING & REPRODUCTION,69.95,2020
,2020 OFFICE OF THE SPEAKER,3,GENERAL EXPENDITURES,PRINTING AND REPRODUCTION,DETAIL,2020-08-05,AP,1320222,ACCURATE WORD LLC,2020-07-29,2020-07-29,PRINTING & REPRODUCTION,39.95,2020
,2020 OFFICE OF THE SPEAKER,3,GENERAL EXPENDITURES,PRINTING AND REPRODUCTION,DETAIL,2020-08-26,GL,MED0100217, ,2020-07-24,2020-07-24,PHOTOGRAPHIC (TRANSFER),20,2020
,2020 OFFICE OF THE SPEAKER,3,GENERAL EXPENDITURES,PRINTING AND REPRODUCTION,DETAIL,2020-09-16,AP,1329714,SHARP BUSINESS SYSTEMS,2020-01-03,2020-03-31,PRINTING & REPRODUCTION,3675.7,2020
,2020 OFFICE OF THE SPEAKER,3,GENERAL EXPENDITURES,PRINTING AND REPRODUCTION,DETAIL,2020-09-24,GL,MED0100963, ,2020-09-03,2020-09-09,PHOTOGRAPHIC (TRANSFER),45.7,2020
,2020 OFFICE OF THE SPEAKER,3,GENERAL EXPENDITURES,PRINTING AND REPRODUCTION,SUBTOTAL,   ,   ,   ,   ,   ,   ,PRINTING AND REPRODUCTION TOTALS:,6991.5,2020
,2020 OFFICE OF THE SPEAKER,3,GENERAL EXPENDITURES,OTHER SERVICES,DETAIL,2020-07-16,AP,1312648,LEIDOS DIGITAL SOLUTIONS INC,2020-07-01,2020-07-31,TECHNOLOGY SERVICE CONTRACTS,1895,2020
,2020 OFFICE OF THE SPEAKER,3,GENERAL EXPENDITURES,OTHER SERVICES,DETAIL,2020-07-20,AP,1311677,FIRESIDE21,2020-06-01,2020-06-30,WEB DEV HST EMAIL & RLTD SERV,350,2020
,2020 OFFICE OF THE SPEAKER,3,GENERAL EXPENDITURES,OTHER SERVICES,DETAIL,2020-08-16,AP,1322986,LEIDOS DIGITAL SOLUTIONS INC,2020-08-01,2020-08-31,TECHNOLOGY SERVICE CONTRACTS,1895,2020
,2020 OFFICE OF THE SPEAKER,3,GENERAL EXPENDITURES,OTHER SERVICES,DETAIL,2020-08-24,AP,1327545,FIRESIDE21,2020-07-01,2020-07-31,WEB DEV HST EMAIL & RLTD SERV,350,2020
,2020 OFFICE OF THE SPEAKER,3,GENERAL EXPENDITURES,OTHER SERVICES,DETAIL,2020-09-16,AP,1333236,LEIDOS DIGITAL SOLUTIONS INC,2020-09-01,2020-09-30,TECHNOLOGY SERVICE CONTRACTS,1895,2020
,2020 OFFICE OF THE SPEAKER,3,GENERAL EXPENDITURES,OTHER SERVICES,DETAIL,2020-09-29,AP,1338755,FEDEX BILLING ONLINE,2020-08-01,2020-08-31,WEB DEV HST EMAIL & RLTD SERV,350,2020
,2020 OFFICE OF THE SPEAKER,3,GENERAL EXPENDITURES,OTHER SERVICES,SUBTOTAL,   ,   ,   ,   ,   ,   ,OTHER SERVICES TOTALS:,6735,2020
,2020 OFFICE OF THE SPEAKER,3,GENERAL EXPENDITURES,SUPPLIES AND MATERIALS,DETAIL,2020-07-02,AP,1307867,CBIS SUBSCRIPTION SERVICE CTR,2020-06-29,2020-06-29,PUBLICATIONS/REFERENCE MAT'L,270,2020
,2020 OFFICE OF THE SPEAKER,3,GENERAL EXPENDITURES,SUPPLIES AND MATERIALS,DETAIL,2020-07-07,AP,1308385,CONGRESS AT YOUR FINGERTIPS,2020-06-30,2020-06-30,PUBLICATIONS/REFERENCE MAT'L,94,2020
,2020 OFFICE OF THE SPEAKER,3,GENERAL EXPENDITURES,SUPPLIES AND MATERIALS,DETAIL,2020-07-08,AP,1309278,TOULIES EN FLEUR,2020-06-22,2020-06-29,HABITATION EXPENSE,400,2020
,2020 OFFICE OF THE SPEAKER,3,GENERAL EXPENDITURES,SUPPLIES AND MATERIALS,DETAIL,2020-07-23,AP,1311109,CITI PCARD-TARGET        00010769,2020-06-02,2020-06-02,FOOD & BEVERAGE,122.96,2020
,2020 OFFICE OF THE SPEAKER,3,GENERAL EXPENDITURES,SUPPLIES AND MATERIALS,DETAIL,2020-07-23,AP,1311109,CITI PCARD-TARGET        00010769,2020-06-02,2020-06-02,OFFICE SUPPLIES (OUTSIDE),7.67,2020
,2020 OFFICE OF THE SPEAKER,3,GENERAL EXPENDITURES,SUPPLIES AND MATERIALS,DETAIL,2020-07-23,AP,1311109,CITI PCARD-WE THE PIZZA,2020-05-27,2020-05-27,FOOD & BEVERAGE,115.44,2020
,2020 OFFICE OF THE SPEAKER,3,GENERAL EXPENDITURES,SUPPLIES AND MATERIALS,DETAIL,2020-07-23,AP,1311109,CITI PCARD-WE THE PIZZA,2020-05-28,2020-05-28,FOOD & BEVERAGE,115.44,2020
,2020 OFFICE OF THE SPEAKER,3,GENERAL EXPENDITURES,SUPPLIES AND MATERIALS,DETAIL,2020-07-23,AP,1311109,CITI PCARD-WE THE PIZZA,2020-06-02,2020-06-02,FOOD & BEVERAGE,127.65,2020
,2020 OFFICE OF THE SPEAKER,3,GENERAL EXPENDITURES,SUPPLIES AND MATERIALS,DETAIL,2020-07-23,AP,1311109,CITI PCARD-WE THE PIZZA,2020-06-03,2020-06-03,FOOD & BEVERAGE,115.44,2020
,2020 OFFICE OF THE SPEAKER,3,GENERAL EXPENDITURES,SUPPLIES AND MATERIALS,DETAIL,2020-07-23,AP,1311109,CITI PCARD-WE THE PIZZA,2020-06-04,2020-06-04,FOOD & BEVERAGE,116.56,2020
,2020 OFFICE OF THE SPEAKER,3,GENERAL EXPENDITURES,SUPPLIES AND MATERIALS,DETAIL,2020-07-23,AP,1311109,CITI PCARD-WWW COSTCO COM,2020-06-17,2020-06-17,FOOD & BEVERAGE,75.98,2020
,2020 OFFICE OF THE SPEAKER,3,GENERAL EXPENDITURES,SUPPLIES AND MATERIALS,DETAIL,2020-07-23,AP,1312021,CONNECTION,2020-06-19,2020-06-19,OFFICE SUPPLIES (OUTSIDE),526.9,2020
,2020 OFFICE OF THE SPEAKER,3,GENERAL EXPENDITURES,SUPPLIES AND MATERIALS,DETAIL,2020-07-23,AP,1312024,CONNECTION,2020-06-29,2020-06-29,OFFICE SUPPLIES (OUTSIDE),51.27,2020
,2020 OFFICE OF THE SPEAKER,3,GENERAL EXPENDITURES,SUPPLIES AND MATERIALS,DETAIL,2020-07-24,AP,1312026,CONNECTION,2020-06-29,2020-06-29,OFFICE SUPPLIES (OUTSIDE),539.39,2020
,2020 OFFICE OF THE SPEAKER,3,GENERAL EXPENDITURES,SUPPLIES AND MATERIALS,DETAIL,2020-07-24,AP,1312027,CONNECTION,2020-06-15,2020-06-15,OFFICE SUPPLIES (OUTSIDE),5326.75,2020
,2020 OFFICE OF THE SPEAKER,3,GENERAL EXPENDITURES,SUPPLIES AND MATERIALS,DETAIL,2020-07-31,GL,RMS0099738, ,2020-07-01,2020-07-31,OFFICE SUPPLY (TRANSFER),1279.57,2020
,2020 OFFICE OF THE SPEAKER,3,GENERAL EXPENDITURES,SUPPLIES AND MATERIALS,DETAIL,2020-08-03,AP,1318054,TOULIES EN FLEUR,2020-07-13,2020-07-27,HABITATION EXPENSE,600,2020
,2020 OFFICE OF THE SPEAKER,3,GENERAL EXPENDITURES,SUPPLIES AND MATERIALS,DETAIL,2020-08-05,AP,1320213,TOULIES EN FLEUR,2020-07-27,2020-07-27,HABITATION EXPENSE,4855,2020
,2020 OFFICE OF THE SPEAKER,3,GENERAL EXPENDITURES,SUPPLIES AND MATERIALS,DETAIL,2020-08-05,AP,1320227,CONNECTION,2020-06-26,2020-06-26,OFFICE SUPPLIES (OUTSIDE),41.85,2020
,2020 OFFICE OF THE SPEAKER,3,GENERAL EXPENDITURES,SUPPLIES AND MATERIALS,DETAIL,2020-08-05,AP,1320230,CONNECTION,2020-07-27,2020-07-27,OFFICE SUPPLIES (OUTSIDE),241.71,2020
,2020 OFFICE OF THE SPEAKER,3,GENERAL EXPENDITURES,SUPPLIES AND MATERIALS,DETAIL,2020-08-06,AP,1320211,TOULIES EN FLEUR,2020-07-20,2020-07-20,HABITATION EXPENSE,300,2020
,2020 OFFICE OF THE SPEAKER,3,GENERAL EXPENDITURES,SUPPLIES AND MATERIALS,DETAIL,2020-08-13,AP,1321534,OCCASIONS CATERERS,2020-07-28,2020-07-28,FOOD & BEVERAGE,2552,2020