BIOGUIDE_ID,OFFICE,QUARTER,PROGRAM,CATEGORY,SORT SEQUENCE,DATE,TRANSCODE,RECORDID,PAYEE,START DATE,END DATE,PURPOSE,AMOUNT,YEAR
,2020 OFFICE OF THE SPEAKER,4,GENERAL EXPENDITURES,FRANKED MAIL,DETAIL,2020-10-27,AP,1347818,UNITED STATES POSTAL SERVICE,2020-09-01,2020-09-30,FRANKED MAIL,1,2020
,2020 OFFICE OF THE SPEAKER,4,GENERAL EXPENDITURES,FRANKED MAIL,SUBTOTAL,   ,   ,   ,   ,   ,   ,FRANKED MAIL TOTALS:,1,2020
,2020 OFFICE OF THE SPEAKER,4,GENERAL EXPENDITURES,PERSONNEL COMPENSATION,DETAIL,   ,   ,   ,BERRET EMILY C,2020-10-01,2020-12-31,DIR OF OPERATIONS & ADVISOR,39175.01,2020
,2020 OFFICE OF THE SPEAKER,4,GENERAL EXPENDITURES,PERSONNEL COMPENSATION,DETAIL,   ,   ,   ,BUSH JACQUELINE D,2020-10-01,2020-12-31,DIGITAL ASSISTANT,6048.6,2020
,2020 OFFICE OF THE SPEAKER,4,GENERAL EXPENDITURES,PERSONNEL COMPENSATION,DETAIL,   ,   ,   ,CAPRON MARGARET W.,2020-10-01,2020-12-31,SENIOR ADV FOR POLICY & COMM,41074.01,2020
,2020 OFFICE OF THE SPEAKER,4,GENERAL EXPENDITURES,PERSONNEL COMPENSATION,DETAIL,   ,   ,   ,CHERRY STEPHANIE,2020-10-01,2020-12-31,DIRECTOR OF MEDIA AFFAIRS,26500,2020
,2020 OFFICE OF THE SPEAKER,4,GENERAL EXPENDITURES,PERSONNEL COMPENSATION,DETAIL,   ,   ,   ,CONNELLY HENRY V,2020-08-01,2020-10-31,DEPUTY COMMUNICATIONS DIRECTOR,16020,2020
,2020 OFFICE OF THE SPEAKER,4,GENERAL EXPENDITURES,PERSONNEL COMPENSATION,DETAIL,   ,   ,   ,CONNELLY HENRY V,2020-10-01,2020-12-31,COMMUNICATIONS DIRECTOR,28196.67,2020
,2020 OFFICE OF THE SPEAKER,4,GENERAL EXPENDITURES,PERSONNEL COMPENSATION,DETAIL,   ,   ,   ,COSTELLO JOSEPH M,2020-10-01,2020-12-31,PRESS ASSISTANT,12541.66,2020
,2020 OFFICE OF THE SPEAKER,4,GENERAL EXPENDITURES,PERSONNEL COMPENSATION,DETAIL,   ,   ,   ,COSTELLO JOSEPH M,2020-09-01,2020-11-30,PRESS ASSISTANT (OVERTIME),9035.5,2020
,2020 OFFICE OF THE SPEAKER,4,GENERAL EXPENDITURES,PERSONNEL COMPENSATION,DETAIL,   ,   ,   ,DEGRAFF KENNETH B.,2020-10-01,2020-12-31,SENIOR POLICY ADVISOR,35250.01,2020
,2020 OFFICE OF THE SPEAKER,4,GENERAL EXPENDITURES,PERSONNEL COMPENSATION,DETAIL,   ,   ,   ,DEWHIRST DIANE,2020-10-01,2020-12-31,DEPUTY CHIEF OF STAFF,43475.01,2020
,2020 OFFICE OF THE SPEAKER,4,GENERAL EXPENDITURES,PERSONNEL COMPENSATION,DETAIL,   ,   ,   ,DILLON KRISTEN G,2020-10-01,2020-12-31,POLICY ADVISOR,300,2020
,2020 OFFICE OF THE SPEAKER,4,GENERAL EXPENDITURES,PERSONNEL COMPENSATION,DETAIL,   ,   ,   ,DONOHUE JENNIFER A,2020-10-01,2020-12-31,EXECUTIVE DIRECTOR,41250,2020
,2020 OFFICE OF THE SPEAKER,4,GENERAL EXPENDITURES,PERSONNEL COMPENSATION,DETAIL,   ,   ,   ,EDMONSON ROBERT D,2020-03-01,2020-12-31,POLICY ADVISOR,42025,2020
,2020 OFFICE OF THE SPEAKER,4,GENERAL EXPENDITURES,PERSONNEL COMPENSATION,DETAIL,   ,   ,   ,EHRENBERG MIA R,2020-11-01,2020-11-30,PRESS ADVISOR,1458.33,2020
,2020 OFFICE OF THE SPEAKER,4,GENERAL EXPENDITURES,PERSONNEL COMPENSATION,DETAIL,   ,   ,   ,EHRENBERG MIA R,2020-11-01,2020-12-31,DEPUTY PRESS SECRETARY,8884.72,2020
,2020 OFFICE OF THE SPEAKER,4,GENERAL EXPENDITURES,PERSONNEL COMPENSATION,DETAIL,   ,   ,   ,FINNEY FELICIA V,2020-10-01,2020-12-31,STAFF ASSISTANT,13624.99,2020
,2020 OFFICE OF THE SPEAKER,4,GENERAL EXPENDITURES,PERSONNEL COMPENSATION,DETAIL,   ,   ,   ,FINNEY FELICIA V,2020-09-01,2020-11-30,STAFF ASSISTANT (OVERTIME),3769.43,2020
,2020 OFFICE OF THE SPEAKER,4,GENERAL EXPENDITURES,PERSONNEL COMPENSATION,DETAIL,   ,   ,   ,FISCHER JR ROBERT V.,2020-10-01,2020-12-31,ASST FLOOR CHIEF,43475.01,2020
,2020 OFFICE OF THE SPEAKER,4,GENERAL EXPENDITURES,PERSONNEL COMPENSATION,DETAIL,   ,   ,   ,FLEET II JAMES P,2020-10-01,2020-12-31,SENIOR ADVISOR,300,2020
,2020 OFFICE OF THE SPEAKER,4,GENERAL EXPENDITURES,PERSONNEL COMPENSATION,DETAIL,   ,   ,   ,GARCIA MONICA,2020-10-01,2020-12-31,COMMUNICATIONS DIRECTOR,17000.01,2020
,2020 OFFICE OF THE SPEAKER,4,GENERAL EXPENDITURES,PERSONNEL COMPENSATION,DETAIL,   ,   ,   ,GIBSON DYLAN B,2020-10-01,2020-12-31,DIGITAL DIRECTOR,20250.01,2020
,2020 OFFICE OF THE SPEAKER,4,GENERAL EXPENDITURES,PERSONNEL COMPENSATION,DETAIL,   ,   ,   ,GREENER APRIL L.,2020-10-01,2020-12-31,RESEARCH DIRECTOR,32250.01,2020
,2020 OFFICE OF THE SPEAKER,4,GENERAL EXPENDITURES,PERSONNEL COMPENSATION,DETAIL,   ,   ,   ,HAMMILL ANDREW T.,2020-10-01,2020-12-31,DEPUTY CHIEF OF STAFF,43475.01,2020
,2020 OFFICE OF THE SPEAKER,4,GENERAL EXPENDITURES,PERSONNEL COMPENSATION,DETAIL,   ,   ,   ,HAN LEAH J.,2020-10-01,2020-12-31,STAFF ASSISTANT,12124.99,2020
,2020 OFFICE OF THE SPEAKER,4,GENERAL EXPENDITURES,PERSONNEL COMPENSATION,DETAIL,   ,   ,   ,HAN LEAH J.,2020-09-01,2020-11-30,STAFF ASSISTANT (OVERTIME),3186.38,2020
,2020 OFFICE OF THE SPEAKER,4,GENERAL EXPENDITURES,PERSONNEL COMPENSATION,DETAIL,   ,   ,   ,HAYNES JR WILFRED J.,2020-10-01,2020-12-31,IT DIRECTOR,32280.49,2020
,2020 OFFICE OF THE SPEAKER,4,GENERAL EXPENDITURES,PERSONNEL COMPENSATION,DETAIL,   ,   ,   ,HIDALGO ADRIANA N,2020-10-01,2020-12-31,DISTRICT SCHED/SPECIAL ASSIST,24000.01,2020
,2020 OFFICE OF THE SPEAKER,4,GENERAL EXPENDITURES,PERSONNEL COMPENSATION,DETAIL,   ,   ,   ,HOLMES NATHANIEL J,2020-10-01,2020-12-31,DEP DIR/SCHEDULING & ADVANCE,22249.99,2020
,2020 OFFICE OF THE SPEAKER,4,GENERAL EXPENDITURES,PERSONNEL COMPENSATION,DETAIL,   ,   ,   ,HURWITZ ROSS B,2020-10-01,2020-12-31,DEPUTY DIR. OF SPEECHWRITING,20250.01,2020
,2020 OFFICE OF THE SPEAKER,4,GENERAL EXPENDITURES,PERSONNEL COMPENSATION,DETAIL,   ,   ,   ,IACOBELLIS SAMUEL C,2020-10-01,2020-12-31,MBR SVC & INTERGOV AFFAIRS ADV,16624.99,2020
,2020 OFFICE OF THE SPEAKER,4,GENERAL EXPENDITURES,PERSONNEL COMPENSATION,DETAIL,   ,   ,   ,JACKSON AUDRA L,2020-10-01,2020-12-31,ASST MGR FOR THE DEM CLOAKROOM,21499.99,2020
,2020 OFFICE OF THE SPEAKER,4,GENERAL EXPENDITURES,PERSONNEL COMPENSATION,DETAIL,   ,   ,   ,JETER KRISTINA B,2020-10-01,2020-12-31,DPTY DIR/SPEC EVENT & PROTOCOL,13999.99,2020
,2020 OFFICE OF THE SPEAKER,4,GENERAL EXPENDITURES,PERSONNEL COMPENSATION,DETAIL,   ,   ,   ,JONES MEREDITH A,2020-10-01,2020-12-31,SENIOR ADVISOR,41250,2020
,2020 OFFICE OF THE SPEAKER,4,GENERAL EXPENDITURES,PERSONNEL COMPENSATION,DETAIL,   ,   ,   ,KAPLAN EMMA L,2020-10-01,2020-12-31,FLOOR ADVISOR,24000.01,2020
,2020 OFFICE OF THE SPEAKER,4,GENERAL EXPENDITURES,PERSONNEL COMPENSATION,DETAIL,   ,   ,   ,KEATING ROSE M,2020-10-01,2020-12-31,ASST FLOOR MANAGER,36841.65,2020
,2020 OFFICE OF THE SPEAKER,4,GENERAL EXPENDITURES,PERSONNEL COMPENSATION,DETAIL,   ,   ,   ,KEITA KAMILAH Z,2020-10-01,2020-12-31,DEPUTY INFOMATION TECH. DIRECT,28783,2020
,2020 OFFICE OF THE SPEAKER,4,GENERAL EXPENDITURES,PERSONNEL COMPENSATION,DETAIL,   ,   ,   ,KUNDANIS GEORGE,2020-10-01,2020-12-31,DEPUTY CHIEF OF STAFF,43475.01,2020
,2020 OFFICE OF THE SPEAKER,4,GENERAL EXPENDITURES,PERSONNEL COMPENSATION,DETAIL,   ,   ,   ,LA ALISA M,2020-10-01,2020-12-31,SPECIAL ASST TO THE SPEAKER,26500,2020
,2020 OFFICE OF THE SPEAKER,4,GENERAL EXPENDITURES,PERSONNEL COMPENSATION,DETAIL,   ,   ,   ,LEE SERYEUNG,2020-10-01,2020-12-31,PRESS SECRETARY,24000.01,2020
,2020 OFFICE OF THE SPEAKER,4,GENERAL EXPENDITURES,PERSONNEL COMPENSATION,DETAIL,   ,   ,   ,LIZARRAGA JAIME E.,2020-10-01,2020-12-31,SENIOR ADVISOR,43475.01,2020
,2020 OFFICE OF THE SPEAKER,4,GENERAL EXPENDITURES,PERSONNEL COMPENSATION,DETAIL,   ,   ,   ,LONG MICHAEL G,2020-10-01,2020-12-31,SR ADV & DIR OF MBR SERV,36841.65,2020
,2020 OFFICE OF THE SPEAKER,4,GENERAL EXPENDITURES,PERSONNEL COMPENSATION,DETAIL,   ,   ,   ,MANGRUM PEARL J.,2020-10-01,2020-12-31,FINANCIAL ADMINISTRATOR,37224.96,2020
,2020 OFFICE OF THE SPEAKER,4,GENERAL EXPENDITURES,PERSONNEL COMPENSATION,DETAIL,   ,   ,   ,MANSBACH SHANA G,2020-10-01,2020-12-31,DIRECTOR OF SPEECHWRITING,28999.99,2020
,2020 OFFICE OF THE SPEAKER,4,GENERAL EXPENDITURES,PERSONNEL COMPENSATION,DETAIL,   ,   ,   ,MARRON BRENNA K,2020-10-01,2020-12-31,DEPUTY EXEC DIRECTOR,28749.99,2020
,2020 OFFICE OF THE SPEAKER,4,GENERAL EXPENDITURES,PERSONNEL COMPENSATION,DETAIL,   ,   ,   ,MASON GRAHAM H,2020-10-01,2020-12-31,SENIOR ADVISOR,32250,2020
,2020 OFFICE OF THE SPEAKER,4,GENERAL EXPENDITURES,PERSONNEL COMPENSATION,DETAIL,   ,   ,   ,MCCULLOUGH MARY T,2020-10-01,2020-12-31,CHIEF OF STAFF,43475.01,2020
,2020 OFFICE OF THE SPEAKER,4,GENERAL EXPENDITURES,PERSONNEL COMPENSATION,DETAIL,   ,   ,   ,MCCULLOUGH WILLIAM J,2020-10-01,2020-12-31,PRESS ASSISTANT,12541.66,2020
,2020 OFFICE OF THE SPEAKER,4,GENERAL EXPENDITURES,PERSONNEL COMPENSATION,DETAIL,   ,   ,   ,MCCULLOUGH WILLIAM J,2020-09-01,2020-11-30,PRESS ASSISTANT (OVERTIME),9558.15,2020
,2020 OFFICE OF THE SPEAKER,4,GENERAL EXPENDITURES,PERSONNEL COMPENSATION,DETAIL,   ,   ,   ,MELTZER RICHARD,2020-10-01,2020-12-31,POLICY DIRECTOR,43475.01,2020
,2020 OFFICE OF THE SPEAKER,4,GENERAL EXPENDITURES,PERSONNEL COMPENSATION,DETAIL,   ,   ,   ,MILLER MONTANA R,2020-10-01,2020-12-31,DEPUTY DIRECTOR OF SCHEDULING,19999.99,2020
,2020 OFFICE OF THE SPEAKER,4,GENERAL EXPENDITURES,PERSONNEL COMPENSATION,DETAIL,   ,   ,   ,MONGE KATHERINE S,2020-10-01,2020-12-31,SENIOR COUNSEL,43475.01,2020
,2020 OFFICE OF THE SPEAKER,4,GENERAL EXPENDITURES,PERSONNEL COMPENSATION,DETAIL,   ,   ,   ,PARKER WYNDEE R.,2020-10-01,2020-12-31,NATIONAL SECURITY ADVISOR,43475.01,2020
,2020 OFFICE OF THE SPEAKER,4,GENERAL EXPENDITURES,PERSONNEL COMPENSATION,DETAIL,   ,   ,   ,POWELL LATRICE S,2020-10-01,2020-12-31,DEPUTY FLOOR DIRECTOR,40175.01,2020
,2020 OFFICE OF THE SPEAKER,4,GENERAL EXPENDITURES,PERSONNEL COMPENSATION,DETAIL,   ,   ,   ,PRICE REVA B.,2020-10-01,2020-12-31,OUTREACH DIR & SENIOR ADVISOR,41741.01,2020
,2020 OFFICE OF THE SPEAKER,4,GENERAL EXPENDITURES,PERSONNEL COMPENSATION,DETAIL,   ,   ,   ,PRIMUS WENDELL E.,2020-10-01,2020-12-31,SR HLTH/BUDGET POLICY ADV,43475.01,2020
,2020 OFFICE OF THE SPEAKER,4,GENERAL EXPENDITURES,PERSONNEL COMPENSATION,DETAIL,   ,   ,   ,RAMIREZ MATTHEW M,2020-10-01,2020-12-31,OUTREACH ADVISOR,17125,2020
,2020 OFFICE OF THE SPEAKER,4,GENERAL EXPENDITURES,PERSONNEL COMPENSATION,DETAIL,   ,   ,   ,ROBLES CLARISSA V,2020-10-01,2020-12-31,MEMBER SERVICES COORDINATOR,12500.01,2020
,2020 OFFICE OF THE SPEAKER,4,GENERAL EXPENDITURES,PERSONNEL COMPENSATION,DETAIL,   ,   ,   ,ROSS PATRICIA L,2020-10-01,2020-12-31,SENIOR POLICY ADVISOR,28249.99,2020
,2020 OFFICE OF THE SPEAKER,4,GENERAL EXPENDITURES,PERSONNEL COMPENSATION,DETAIL,   ,   ,   ,RUSSELL MAYA A,2020-10-01,2020-12-31,DIGITAL DIRECTOR,13749.99,2020
,2020 OFFICE OF THE SPEAKER,4,GENERAL EXPENDITURES,PERSONNEL COMPENSATION,DETAIL,   ,   ,   ,SANCHEZ CARLOS S.,2020-10-01,2020-12-31,SENIOR ADVISOR,42750,2020
,2020 OFFICE OF THE SPEAKER,4,GENERAL EXPENDITURES,PERSONNEL COMPENSATION,DETAIL,   ,   ,   ,SMITH KELSEY L,2020-10-01,2020-12-31,DIR. OF SCHEDULING & ADVANCE,36841.65,2020
,2020 OFFICE OF THE SPEAKER,4,GENERAL EXPENDITURES,PERSONNEL COMPENSATION,DETAIL,   ,   ,   ,SMITH SHANE T,2020-10-01,2020-12-31,SENIOR ADVISOR/MEMBER SERVICES,23222.23,2020
,2020 OFFICE OF THE SPEAKER,4,GENERAL EXPENDITURES,PERSONNEL COMPENSATION,DETAIL,   ,   ,   ,STERN KEITH L.,2020-10-01,2020-12-31,DIRECTOR OF FLOOR OPERATIONS,43475.01,2020
,2020 OFFICE OF THE SPEAKER,4,GENERAL EXPENDITURES,PERSONNEL COMPENSATION,DETAIL,   ,   ,   ,SWIG SARAH B,2020-10-01,2020-12-31,POLICY ASSOCIATE,17125,2020
,2020 OFFICE OF THE SPEAKER,4,GENERAL EXPENDITURES,PERSONNEL COMPENSATION,DETAIL,   ,   ,   ,TECKLENBURG MICHAEL H.,2020-10-01,2020-12-31,COUNSEL,40841.65,2020
,2020 OFFICE OF THE SPEAKER,4,GENERAL EXPENDITURES,PERSONNEL COMPENSATION,DETAIL,   ,   ,   ,URRY ALEXANDER M,2020-10-01,2020-12-31,POLICY ADVISOR,17749.99,2020
,2020 OFFICE OF THE SPEAKER,4,GENERAL EXPENDITURES,PERSONNEL COMPENSATION,DETAIL,   ,   ,   ,WOLFF CELINE K.,2020-10-01,2020-12-31,DEPUTY DIGITAL DIRECTOR,14458.33,2020
,2020 OFFICE OF THE SPEAKER,4,GENERAL EXPENDITURES,PERSONNEL COMPENSATION,DETAIL,   ,   ,   ,WOLFF CELINE K.,2020-09-01,2020-11-30,DEPUTY DIGITAL DIRECTOR (OVERTIME),4662.21,2020
,2020 OFFICE OF THE SPEAKER,4,GENERAL EXPENDITURES,PERSONNEL COMPENSATION,DETAIL,   ,   ,   ,WOLTERS KATE,2020-10-01,2020-12-31,DIRECTOR OF SPECIAL EVENTS,2499.99,2020
,2020 OFFICE OF THE SPEAKER,4,GENERAL EXPENDITURES,PERSONNEL COMPENSATION,SUBTOTAL,   ,   ,   ,   ,   ,   ,PERSONNEL COMPENSATION TOTALS:,1780629.03,2020
,2020 OFFICE OF THE SPEAKER,4,GENERAL EXPENDITURES,TRAVEL,DETAIL,2020-12-04,AP,1360345,HIDALGO ADRIANA N.,2020-09-03,2020-09-03,MEALS,6.75,2020
,2020 OFFICE OF THE SPEAKER,4,GENERAL EXPENDITURES,TRAVEL,SUBTOTAL,   ,   ,   ,   ,   ,   ,TRAVEL TOTALS:,6.75,2020
,2020 OFFICE OF THE SPEAKER,4,GENERAL EXPENDITURES,RENT  COMMUNICATION  UTILITIES,DETAIL,2020-10-08,AP,1340701,FEDEX,2020-09-11,2020-09-11,POSTAGE / COURIER / BOX RENTAL,13.45,2020
,2020 OFFICE OF THE SPEAKER,4,GENERAL EXPENDITURES,RENT  COMMUNICATION  UTILITIES,DETAIL,2020-10-27,GL,EMS0101782, ,2020-09-01,2020-09-30,DC TELECOM EQUIP (TRANSFER),228,2020
,2020 OFFICE OF THE SPEAKER,4,GENERAL EXPENDITURES,RENT  COMMUNICATION  UTILITIES,DETAIL,2020-10-27,GL,EMS0101782, ,2020-09-01,2020-09-30,DC TELECOM SERV (TRANSFER),1224.75,2020
,2020 OFFICE OF THE SPEAKER,4,GENERAL EXPENDITURES,RENT  COMMUNICATION  UTILITIES,DETAIL,2020-10-27,GL,EMS0101782, ,2020-09-01,2020-09-30,DC TELECOM TOLLS (TRANSFER),9535.51,2020
,2020 OFFICE OF THE SPEAKER,4,GENERAL EXPENDITURES,RENT  COMMUNICATION  UTILITIES,DETAIL,2020-10-28,GL,MED0101823, ,2020-09-24,2020-09-24,HIR GRAPHICS (TRANSFER),100,2020
,2020 OFFICE OF THE SPEAKER,4,GENERAL EXPENDITURES,RENT  COMMUNICATION  UTILITIES,DETAIL,2020-11-17,AP,1354356,FEDEX,2020-09-25,2020-09-25,POSTAGE / COURIER / BOX RENTAL,195.64,2020
,2020 OFFICE OF THE SPEAKER,4,GENERAL EXPENDITURES,RENT  COMMUNICATION  UTILITIES,DETAIL,2020-11-20,AP,1356847,FEDEX,2020-10-27,2020-10-27,POSTAGE / COURIER / BOX RENTAL,10.55,2020
,2020 OFFICE OF THE SPEAKER,4,GENERAL EXPENDITURES,RENT  COMMUNICATION  UTILITIES,DETAIL,2020-11-20,GL,EMS0102354, ,2020-10-01,2020-10-31,DC TELECOM EQUIP (TRANSFER),224,2020
,2020 OFFICE OF THE SPEAKER,4,GENERAL EXPENDITURES,RENT  COMMUNICATION  UTILITIES,DETAIL,2020-11-20,GL,EMS0102354, ,2020-10-01,2020-10-31,DC TELECOM SERV (TRANSFER),1204.25,2020
,2020 OFFICE OF THE SPEAKER,4,GENERAL EXPENDITURES,RENT  COMMUNICATION  UTILITIES,DETAIL,2020-11-20,GL,EMS0102354, ,2020-10-01,2020-10-31,DC TELECOM TOLLS (TRANSFER),8706.88,2020
,2020 OFFICE OF THE SPEAKER,4,GENERAL EXPENDITURES,RENT  COMMUNICATION  UTILITIES,DETAIL,2020-11-24,GL,MED0102426, ,2020-11-11,2020-11-20,HIR GRAPHICS (TRANSFER),500,2020
,2020 OFFICE OF THE SPEAKER,4,GENERAL EXPENDITURES,RENT  COMMUNICATION  UTILITIES,DETAIL,2020-12-07,AP,1360365,WOLTERS KATE,2020-11-23,2020-11-23,POSTAGE / COURIER / BOX RENTAL,136.24,2020
,2020 OFFICE OF THE SPEAKER,4,GENERAL EXPENDITURES,RENT  COMMUNICATION  UTILITIES,DETAIL,2020-12-22,AP,1367381,FEDEX,2020-11-20,2020-11-20,POSTAGE / COURIER / BOX RENTAL,20.55,2020
,2020 OFFICE OF THE SPEAKER,4,GENERAL EXPENDITURES,RENT  COMMUNICATION  UTILITIES,DETAIL,2020-12-28,GL,EMS0103149, ,2020-11-01,2020-11-30,DC TELECOM EQUIP (TRANSFER),224,2020
,2020 OFFICE OF THE SPEAKER,4,GENERAL EXPENDITURES,RENT  COMMUNICATION  UTILITIES,DETAIL,2020-12-28,GL,EMS0103149, ,2020-11-01,2020-11-30,DC TELECOM SERV (TRANSFER),1204.25,2020
,2020 OFFICE OF THE SPEAKER,4,GENERAL EXPENDITURES,RENT  COMMUNICATION  UTILITIES,DETAIL,2020-12-28,GL,EMS0103149, ,2020-11-01,2020-11-30,DC TELECOM TOLLS (TRANSFER),7175.7,2020
,2020 OFFICE OF THE SPEAKER,4,GENERAL EXPENDITURES,RENT  COMMUNICATION  UTILITIES,DETAIL,2020-12-30,GL,MED0103249, ,2020-12-10,2020-12-16,HIR GRAPHICS (TRANSFER),100,2020
,2020 OFFICE OF THE SPEAKER,4,GENERAL EXPENDITURES,RENT  COMMUNICATION  UTILITIES,SUBTOTAL,   ,   ,   ,   ,   ,   ,RENT  COMMUNICATION  UTILITIES TOTALS:,30803.77,2020
,2020 OFFICE OF THE SPEAKER,4,GENERAL EXPENDITURES,PRINTING AND REPRODUCTION,DETAIL,2020-10-28,GL,MED0101823, ,2020-09-28,2020-10-02,PHOTOGRAPHIC (TRANSFER),120,2020
,2020 OFFICE OF THE SPEAKER,4,GENERAL EXPENDITURES,PRINTING AND REPRODUCTION,DETAIL,2020-11-24,GL,MED0102426, ,2020-10-30,2020-11-19,PHOTOGRAPHIC (TRANSFER),210,2020
,2020 OFFICE OF THE SPEAKER,4,GENERAL EXPENDITURES,PRINTING AND REPRODUCTION,DETAIL,2020-12-30,GL,MED0103249, ,2020-12-11,2020-12-11,PHOTOGRAPHIC (TRANSFER),40,2020
,2020 OFFICE OF THE SPEAKER,4,GENERAL EXPENDITURES,PRINTING AND REPRODUCTION,SUBTOTAL,   ,   ,   ,   ,   ,   ,PRINTING AND REPRODUCTION TOTALS:,370,2020
,2020 OFFICE OF THE SPEAKER,4,GENERAL EXPENDITURES,OTHER SERVICES,DETAIL,2020-10-07,AR,AC-16285,FEDERAL EXPRESS CORP          ,2020-08-01,2020-08-31,WEB DEV HST EMAIL & RLTD SERV,-350,2020
,2020 OFFICE OF THE SPEAKER,4,GENERAL EXPENDITURES,OTHER SERVICES,DETAIL,2020-10-15,AP,1343012,FIRESIDE21,2020-08-01,2020-08-31,WEB DEV HST EMAIL & RLTD SERV,350,2020
,2020 OFFICE OF THE SPEAKER,4,GENERAL EXPENDITURES,OTHER SERVICES,DETAIL,2020-10-16,AP,1343709,LEIDOS DIGITAL SOLUTIONS INC,2020-10-01,2020-10-31,TECHNOLOGY SERVICE CONTRACTS,1895,2020
,2020 OFFICE OF THE SPEAKER,4,GENERAL EXPENDITURES,OTHER SERVICES,DETAIL,2020-10-21,AP,1347274,FIRESIDE21,2020-09-01,2020-09-30,WEB DEV HST EMAIL & RLTD SERV,350,2020
,2020 OFFICE OF THE SPEAKER,4,GENERAL EXPENDITURES,OTHER SERVICES,DETAIL,2020-11-16,AP,1353434,LEIDOS DIGITAL SOLUTIONS INC,2020-11-01,2020-11-30,TECHNOLOGY SERVICE CONTRACTS,1895,2020
,2020 OFFICE OF THE SPEAKER,4,GENERAL EXPENDITURES,OTHER SERVICES,DETAIL,2020-11-19,AP,1356940,FIRESIDE21,2020-10-01,2020-10-31,WEB DEV HST EMAIL & RLTD SERV,350,2020
,2020 OFFICE OF THE SPEAKER,4,GENERAL EXPENDITURES,OTHER SERVICES,DETAIL,2020-12-16,AP,1364349,LEIDOS DIGITAL SOLUTIONS INC,2020-12-01,2020-12-31,TECHNOLOGY SERVICE CONTRACTS,1895,2020
,2020 OFFICE OF THE SPEAKER,4,GENERAL EXPENDITURES,OTHER SERVICES,DETAIL,2020-12-17,AP,1367280,FIRESIDE21,2020-11-01,2020-11-30,WEB DEV HST EMAIL & RLTD SERV,350,2020
,2020 OFFICE OF THE SPEAKER,4,GENERAL EXPENDITURES,OTHER SERVICES,SUBTOTAL,   ,   ,   ,   ,   ,   ,OTHER SERVICES TOTALS:,6735,2020
,2020 OFFICE OF THE SPEAKER,4,GENERAL EXPENDITURES,SUPPLIES AND MATERIALS,DETAIL,2020-10-02,AP,1332661,TOULIES EN FLEUR,2020-09-08,2020-09-28,HABITATION EXPENSE,800,2020
,2020 OFFICE OF THE SPEAKER,4,GENERAL EXPENDITURES,SUPPLIES AND MATERIALS,DETAIL,2020-10-08,AP,1340697,OCCASIONS CATERERS,2020-09-25,2020-09-25,FOOD & BEVERAGE,3220,2020
,2020 OFFICE OF THE SPEAKER,4,GENERAL EXPENDITURES,SUPPLIES AND MATERIALS,DETAIL,2020-10-08,AP,1340702,TOULIES EN FLEUR,2020-10-05,2020-10-05,HABITATION EXPENSE,200,2020
,2020 OFFICE OF THE SPEAKER,4,GENERAL EXPENDITURES,SUPPLIES AND MATERIALS,DETAIL,2020-10-08,AP,1340709,CONNECTION,2020-09-11,2020-09-11,OFFICE SUPPLIES (OUTSIDE),513.49,2020
,2020 OFFICE OF THE SPEAKER,4,GENERAL EXPENDITURES,SUPPLIES AND MATERIALS,DETAIL,2020-10-08,AP,1340710,CONNECTION,2020-09-22,2020-09-22,OFFICE SUPPLIES (OUTSIDE),1372,2020
,2020 OFFICE OF THE SPEAKER,4,GENERAL EXPENDITURES,SUPPLIES AND MATERIALS,DETAIL,2020-10-08,AP,1340712,CONNECTION,2020-09-08,2020-09-08,OFFICE SUPPLIES (OUTSIDE),505.68,2020
,2020 OFFICE OF THE SPEAKER,4,GENERAL EXPENDITURES,SUPPLIES AND MATERIALS,DETAIL,2020-10-08,AP,1340713,CONNECTION,2020-09-25,2020-09-25,OFFICE SUPPLIES (OUTSIDE),169.98,2020
,2020 OFFICE OF THE SPEAKER,4,GENERAL EXPENDITURES,SUPPLIES AND MATERIALS,DETAIL,2020-10-08,AP,1340715,CONNECTION,2020-09-23,2020-09-23,OFFICE SUPPLIES (OUTSIDE),169.04,2020
,2020 OFFICE OF THE SPEAKER,4,GENERAL EXPENDITURES,SUPPLIES AND MATERIALS,DETAIL,2020-10-08,AP,1340716,CONNECTION,2020-09-09,2020-09-09,OFFICE SUPPLIES (OUTSIDE),259,2020
,2020 OFFICE OF THE SPEAKER,4,GENERAL EXPENDITURES,SUPPLIES AND MATERIALS,DETAIL,2020-10-09,AP,1340699,OCCASIONS CATERERS,2020-09-25,2020-09-25,FOOD & BEVERAGE,6800,2020
,2020 OFFICE OF THE SPEAKER,4,GENERAL EXPENDITURES,SUPPLIES AND MATERIALS,DETAIL,2020-10-09,AP,1340706,CONNECTION,2020-08-21,2020-08-21,OFFICE SUPPLIES (OUTSIDE),433,2020
,2020 OFFICE OF THE SPEAKER,4,GENERAL EXPENDITURES,SUPPLIES AND MATERIALS,DETAIL,2020-10-19,AP,1341609,CITI PCARD-WE THE PIZZA,2020-09-09,2020-09-09,FOOD & BEVERAGE,151.11,2020
,2020 OFFICE OF THE SPEAKER,4,GENERAL EXPENDITURES,SUPPLIES AND MATERIALS,DETAIL,2020-10-19,AP,1341609,CITI PCARD-WE THE PIZZA,2020-09-22,2020-09-22,FOOD & BEVERAGE,189.75,2020
,2020 OFFICE OF THE SPEAKER,4,GENERAL EXPENDITURES,SUPPLIES AND MATERIALS,DETAIL,2020-10-21,AP,1347029,SUBURBAN FLORIST INC,2020-09-21,2020-09-21,HABITATION EXPENSE,500,2020
,2020 OFFICE OF THE SPEAKER,4,GENERAL EXPENDITURES,SUPPLIES AND MATERIALS,DETAIL,2020-10-30,GL,RMS0101913, ,2020-10-01,2020-10-31,OFFICE SUPPLY (TRANSFER),280,2020
,2020 OFFICE OF THE SPEAKER,4,GENERAL EXPENDITURES,SUPPLIES AND MATERIALS,DETAIL,2020-11-17,AP,1354335,CITI PCARD-AVERY PRODUCTS CORPORATIO,2020-10-08,2020-10-08,OFFICE SUPPLIES (OUTSIDE),59.28,2020
,2020 OFFICE OF THE SPEAKER,4,GENERAL EXPENDITURES,SUPPLIES AND MATERIALS,DETAIL,2020-11-17,AP,1354335,CITI PCARD-WE THE PIZZA,2020-10-01,2020-10-01,FOOD & BEVERAGE,119.42,2020
,2020 OFFICE OF THE SPEAKER,4,GENERAL EXPENDITURES,SUPPLIES AND MATERIALS,DETAIL,2020-11-17,AP,1354335,CITI PCARD-WWW COSTCO COM,2020-09-28,2020-09-28,FOOD & BEVERAGE,159.95,2020
,2020 OFFICE OF THE SPEAKER,4,GENERAL EXPENDITURES,SUPPLIES AND MATERIALS,DETAIL,2020-11-17,AP,1354335,CITI PCARD-WWW COSTCO COM,2020-09-28,2020-09-28,OFFICE SUPPLIES (OUTSIDE),24.98,2020
,2020 OFFICE OF THE SPEAKER,4,GENERAL EXPENDITURES,SUPPLIES AND MATERIALS,DETAIL,2020-11-20,AP,1356844,CONNECTION,2020-10-20,2020-10-20,OFFICE SUPPLIES (OUTSIDE),611,2020
,2020 OFFICE OF THE SPEAKER,4,GENERAL EXPENDITURES,SUPPLIES AND MATERIALS,DETAIL,2020-11-30,GL,RMS0102573, ,2020-11-01,2020-11-30,OFFICE SUPPLY (TRANSFER),309.27,2020
,2020 OFFICE OF THE SPEAKER,4,GENERAL EXPENDITURES,SUPPLIES AND MATERIALS,DETAIL,2020-12-04,AP,1357955,OCCASIONS CATERERS,2020-11-16,2020-11-16,FOOD & BEVERAGE,7060.13,2020
,2020 OFFICE OF THE SPEAKER,4,GENERAL EXPENDITURES,SUPPLIES AND MATERIALS,DETAIL,2020-12-04,AP,1360347,TOULIES EN FLEUR,2020-10-23,2020-10-23,HABITATION EXPENSE,200,2020
,2020 OFFICE OF THE SPEAKER,4,GENERAL EXPENDITURES,SUPPLIES AND MATERIALS,DETAIL,2020-12-04,AP,1360350,TOULIES EN FLEUR,2020-11-02,2020-11-30,HABITATION EXPENSE,1100,2020
,2020 OFFICE OF THE SPEAKER,4,GENERAL EXPENDITURES,SUPPLIES AND MATERIALS,DETAIL,2020-12-04,AP,1360467,CONNECTION,2020-11-18,2020-11-18,OFFICE SUPPLIES (OUTSIDE),117,2020
,2020 OFFICE OF THE SPEAKER,4,GENERAL EXPENDITURES,SUPPLIES AND MATERIALS,DETAIL,2020-12-08,AP,1360356,TOULIES EN FLEUR,2020-12-07,2020-12-07,HABITATION EXPENSE,200,2020
,2020 OFFICE OF THE SPEAKER,4,GENERAL EXPENDITURES,SUPPLIES AND MATERIALS,DETAIL,2020-12-15,AP,1362365,CITI PCARD-WE THE PIZZA,2020-10-30,2020-10-30,FOOD & BEVERAGE,113.67,2020
,2020 OFFICE OF THE SPEAKER,4,GENERAL EXPENDITURES,SUPPLIES AND MATERIALS,DETAIL,2020-12-15,AP,1362365,CITI PCARD-WE THE PIZZA,2020-11-02,2020-11-02,FOOD & BEVERAGE,114.65,2020
,2020 OFFICE OF THE SPEAKER,4,GENERAL EXPENDITURES,SUPPLIES AND MATERIALS,DETAIL,2020-12-15,AP,1362365,CITI PCARD-WE THE PIZZA,2020-11-05,2020-11-05,FOOD & BEVERAGE,138.8,2020
,2020 OFFICE OF THE SPEAKER,4,GENERAL EXPENDITURES,SUPPLIES AND MATERIALS,DETAIL,2020-12-17,AP,1362427,CITI PCARD-SKYPE.COM/GO/BILL,2020-09-24,2020-10-23,SOFTWARE  LESS THAN  $500,2.99,2020
,2020 OFFICE OF THE SPEAKER,4,GENERAL EXPENDITURES,SUPPLIES AND MATERIALS,DETAIL,2020-12-17,AP,1362427,CITI PCARD-SKYPE.COM/GO/BILL,2020-10-24,2020-11-23,SOFTWARE  LESS THAN  $500,2.99,2020
,2020 OFFICE OF THE SPEAKER,4,GENERAL EXPENDITURES,SUPPLIES AND MATERIALS,DETAIL,2020-12-17,AP,1362427,CITI PCARD-SKYPE.COM/GO/BILL,2020-11-24,2020-12-23,SOFTWARE  LESS THAN  $500,2.99,2020
,2020 OFFICE OF THE SPEAKER,4,GENERAL EXPENDITURES,SUPPLIES AND MATERIALS,DETAIL,2020-12-17,AP,1363116,BGOV LLC,2021-01-01,2022-12-31,PUBLICATIONS/REFERENCE MAT'L,11880,2020
,2020 OFFICE OF THE SPEAKER,4,GENERAL EXPENDITURES,SUPPLIES AND MATERIALS,DETAIL,2020-12-17,AP,1363121,NATIONAL NEWS AGENCY INC,2021-01-01,2021-12-31,PUBLICATIONS/REFERENCE MAT'L,2654.37,2020