BIOGUIDE_ID,OFFICE,QUARTER,PROGRAM,CATEGORY,SORT SEQUENCE,DATE,TRANSCODE,RECORDID,PAYEE,START DATE,END DATE,PURPOSE,AMOUNT,YEAR
,2021 OFFICE OF THE SPEAKER,1,GENERAL EXPENDITURES,PERSONNEL COMPENSATION,DETAIL,   ,   ,   ,BERRET EMILY C,2021-01-03,2021-03-31,DIR OF OPERATIONS & ADVISOR,33988.9,2021
,2021 OFFICE OF THE SPEAKER,1,GENERAL EXPENDITURES,PERSONNEL COMPENSATION,DETAIL,   ,   ,   ,BUSH JACQUELINE D,2021-01-03,2021-02-28,DIGITAL ASSISTANT,5236.11,2021
,2021 OFFICE OF THE SPEAKER,1,GENERAL EXPENDITURES,PERSONNEL COMPENSATION,DETAIL,   ,   ,   ,BUSH JACQUELINE D,2021-03-01,2021-03-31,DEPUTY PRESS SECRETARY,4208.33,2021
,2021 OFFICE OF THE SPEAKER,1,GENERAL EXPENDITURES,PERSONNEL COMPENSATION,DETAIL,   ,   ,   ,CAPRON MARGARET W.,2021-01-03,2021-03-31,SENIOR ADV FOR POLICY & COMM,34881.5,2021
,2021 OFFICE OF THE SPEAKER,1,GENERAL EXPENDITURES,PERSONNEL COMPENSATION,DETAIL,   ,   ,   ,CHERRY STEPHANIE,2021-01-03,2021-03-31,DIRECTOR OF MEDIA AFFAIRS,22000,2021
,2021 OFFICE OF THE SPEAKER,1,GENERAL EXPENDITURES,PERSONNEL COMPENSATION,DETAIL,   ,   ,   ,COCHRAN COURTNEY E.,2021-03-29,2021-03-31,DIRECTOR OF STRATEGIC PLANNING,666.67,2021
,2021 OFFICE OF THE SPEAKER,1,GENERAL EXPENDITURES,PERSONNEL COMPENSATION,DETAIL,   ,   ,   ,CONNELLY HENRY V,2021-01-03,2021-03-31,COMMUNICATIONS DIRECTOR,40333.33,2021
,2021 OFFICE OF THE SPEAKER,1,GENERAL EXPENDITURES,PERSONNEL COMPENSATION,DETAIL,   ,   ,   ,COSTELLO JOSEPH M,2021-01-03,2021-03-31,SENIOR PRESS ASSISTANT,6041.67,2021
,2021 OFFICE OF THE SPEAKER,1,GENERAL EXPENDITURES,PERSONNEL COMPENSATION,DETAIL,   ,   ,   ,COSTELLO JOSEPH M,2021-02-01,2021-02-28,PRESS ASSISTANT,3125,2021
,2021 OFFICE OF THE SPEAKER,1,GENERAL EXPENDITURES,PERSONNEL COMPENSATION,DETAIL,   ,   ,   ,COSTELLO JOSEPH M,2021-01-01,2021-01-31,PRESS ASSISTANT (OVERTIME),2751.62,2021
,2021 OFFICE OF THE SPEAKER,1,GENERAL EXPENDITURES,PERSONNEL COMPENSATION,DETAIL,   ,   ,   ,COSTELLO JOSEPH M,2021-02-01,2021-02-28,SENIOR PRESS ASSISTANT (OVERTIME),1778.08,2021
,2021 OFFICE OF THE SPEAKER,1,GENERAL EXPENDITURES,PERSONNEL COMPENSATION,DETAIL,   ,   ,   ,DEGRAFF KENNETH B.,2021-01-03,2021-03-31,SENIOR POLICY ADVISOR,30555.56,2021
,2021 OFFICE OF THE SPEAKER,1,GENERAL EXPENDITURES,PERSONNEL COMPENSATION,DETAIL,   ,   ,   ,DEWHIRST DIANE,2021-01-03,2021-03-31,DEPUTY CHIEF OF STAFF,42508.9,2021
,2021 OFFICE OF THE SPEAKER,1,GENERAL EXPENDITURES,PERSONNEL COMPENSATION,DETAIL,   ,   ,   ,DONOHUE JENNIFER A,2021-01-03,2021-03-31,EXECUTIVE DIRECTOR,40333.33,2021
,2021 OFFICE OF THE SPEAKER,1,GENERAL EXPENDITURES,PERSONNEL COMPENSATION,DETAIL,   ,   ,   ,EDMONSON ROBERT D,2021-01-03,2021-03-31,POLICY ADVISOR,24166.67,2021
,2021 OFFICE OF THE SPEAKER,1,GENERAL EXPENDITURES,PERSONNEL COMPENSATION,DETAIL,   ,   ,   ,EDMONSON ROBERT D,2021-02-01,2021-02-28,CHIEF OF STAFF,12500,2021
,2021 OFFICE OF THE SPEAKER,1,GENERAL EXPENDITURES,PERSONNEL COMPENSATION,DETAIL,   ,   ,   ,EHRENBERG MIA R,2021-01-03,2021-03-31,DEPUTY PRESS SECRETARY,13444.44,2021
,2021 OFFICE OF THE SPEAKER,1,GENERAL EXPENDITURES,PERSONNEL COMPENSATION,DETAIL,   ,   ,   ,FIELDS MCKENZIE R,2021-03-01,2021-03-31,POLICY ADVISOR,2666.67,2021
,2021 OFFICE OF THE SPEAKER,1,GENERAL EXPENDITURES,PERSONNEL COMPENSATION,DETAIL,   ,   ,   ,FINNEY FELICIA V,2021-01-03,2021-03-31,STAFF ASSISTANT,9411.1,2021
,2021 OFFICE OF THE SPEAKER,1,GENERAL EXPENDITURES,PERSONNEL COMPENSATION,DETAIL,   ,   ,   ,FINNEY FELICIA V,2021-01-01,2021-02-28,STAFF ASSISTANT (OVERTIME),1735.25,2021
,2021 OFFICE OF THE SPEAKER,1,GENERAL EXPENDITURES,PERSONNEL COMPENSATION,DETAIL,   ,   ,   ,FISCHER JR ROBERT V.,2021-01-03,2021-03-31,ASST FLOOR CHIEF,42508.9,2021
,2021 OFFICE OF THE SPEAKER,1,GENERAL EXPENDITURES,PERSONNEL COMPENSATION,DETAIL,   ,   ,   ,FLEET II JAMES P,2021-01-03,2021-03-31,SENIOR ADVISOR,293.33,2021
,2021 OFFICE OF THE SPEAKER,1,GENERAL EXPENDITURES,PERSONNEL COMPENSATION,DETAIL,   ,   ,   ,GIBSON DYLAN B,2021-01-03,2021-01-30,DIGITAL DIRECTOR,5055.56,2021
,2021 OFFICE OF THE SPEAKER,1,GENERAL EXPENDITURES,PERSONNEL COMPENSATION,DETAIL,   ,   ,   ,GIBSON DYLAN B,2021-01-30,2021-01-30,DIGITAL DIRECTOR (OTHER COMPENSATION),5416.67,2021
,2021 OFFICE OF THE SPEAKER,1,GENERAL EXPENDITURES,PERSONNEL COMPENSATION,DETAIL,   ,   ,   ,GREENER APRIL L.,2021-01-03,2021-03-31,RESEARCH DIRECTOR,27622.23,2021
,2021 OFFICE OF THE SPEAKER,1,GENERAL EXPENDITURES,PERSONNEL COMPENSATION,DETAIL,   ,   ,   ,HAMILTON WENDY D,2021-01-03,2021-02-28,OUTREACH ASSOCIATE,11277.77,2021
,2021 OFFICE OF THE SPEAKER,1,GENERAL EXPENDITURES,PERSONNEL COMPENSATION,DETAIL,   ,   ,   ,HAMILTON WENDY D,2021-03-01,2021-03-31,OUTREACH & MEMBER SERVICES ADV,7500,2021
,2021 OFFICE OF THE SPEAKER,1,GENERAL EXPENDITURES,PERSONNEL COMPENSATION,DETAIL,   ,   ,   ,HAMMILL ANDREW T.,2021-01-03,2021-03-31,DEPUTY CHIEF OF STAFF,42508.9,2021
,2021 OFFICE OF THE SPEAKER,1,GENERAL EXPENDITURES,PERSONNEL COMPENSATION,DETAIL,   ,   ,   ,HAN LEAH J.,2021-01-03,2021-03-31,STAFF ASSISTANT,7944.44,2021
,2021 OFFICE OF THE SPEAKER,1,GENERAL EXPENDITURES,PERSONNEL COMPENSATION,DETAIL,   ,   ,   ,HAN LEAH J.,2021-01-01,2021-02-28,STAFF ASSISTANT (OVERTIME),1312.49,2021
,2021 OFFICE OF THE SPEAKER,1,GENERAL EXPENDITURES,PERSONNEL COMPENSATION,DETAIL,   ,   ,   ,HAYNES JR WILFRED J.,2021-01-03,2021-03-31,IT DIRECTOR,27652.04,2021
,2021 OFFICE OF THE SPEAKER,1,GENERAL EXPENDITURES,PERSONNEL COMPENSATION,DETAIL,   ,   ,   ,HEIL BRENNAN A.,2021-02-08,2021-03-31,DIGITAL ASSISTANT,5184.73,2021
,2021 OFFICE OF THE SPEAKER,1,GENERAL EXPENDITURES,PERSONNEL COMPENSATION,DETAIL,   ,   ,   ,HEIL BRENNAN A.,2021-02-08,2021-02-28,DIGITAL ASSISTANT (OVERTIME),1920.05,2021
,2021 OFFICE OF THE SPEAKER,1,GENERAL EXPENDITURES,PERSONNEL COMPENSATION,DETAIL,   ,   ,   ,HIDALGO ADRIANA N,2021-01-03,2021-03-31,DISTRICT SCHED/SPECIAL ASSIST,19555.56,2021
,2021 OFFICE OF THE SPEAKER,1,GENERAL EXPENDITURES,PERSONNEL COMPENSATION,DETAIL,   ,   ,   ,HOLMES NATHANIEL J,2021-01-03,2021-03-31,DEP DIR/SCHEDULING & ADVANCE,17844.44,2021
,2021 OFFICE OF THE SPEAKER,1,GENERAL EXPENDITURES,PERSONNEL COMPENSATION,DETAIL,   ,   ,   ,HURWITZ ROSS B,2021-01-03,2021-03-31,DEPUTY DIR. OF SPEECHWRITING,15888.9,2021
,2021 OFFICE OF THE SPEAKER,1,GENERAL EXPENDITURES,PERSONNEL COMPENSATION,DETAIL,   ,   ,   ,IACOBELLIS SAMUEL C,2021-01-03,2021-03-31,MBR SVC & INTERGOV AFFAIRS ADV,15594.44,2021
,2021 OFFICE OF THE SPEAKER,1,GENERAL EXPENDITURES,PERSONNEL COMPENSATION,DETAIL,   ,   ,   ,JACKSON AUDRA L,2021-01-03,2021-03-31,ASST MGR FOR THE DEM CLOAKROOM,17111.1,2021
,2021 OFFICE OF THE SPEAKER,1,GENERAL EXPENDITURES,PERSONNEL COMPENSATION,DETAIL,   ,   ,   ,JETER KRISTINA B,2021-01-03,2021-03-13,DPTY DIR/SPEC EVENT & PROTOCOL,7888.88,2021
,2021 OFFICE OF THE SPEAKER,1,GENERAL EXPENDITURES,PERSONNEL COMPENSATION,DETAIL,   ,   ,   ,JONES MEREDITH A,2021-01-19,2021-01-30,SENIOR ADVISOR,7791.67,2021
,2021 OFFICE OF THE SPEAKER,1,GENERAL EXPENDITURES,PERSONNEL COMPENSATION,DETAIL,   ,   ,   ,KAPLAN EMMA L,2021-01-03,2021-03-31,FLOOR ADVISOR,19555.56,2021
,2021 OFFICE OF THE SPEAKER,1,GENERAL EXPENDITURES,PERSONNEL COMPENSATION,DETAIL,   ,   ,   ,KEATING ROSE M,2021-01-03,2021-03-31,ASST FLOOR MANAGER,31777.77,2021
,2021 OFFICE OF THE SPEAKER,1,GENERAL EXPENDITURES,PERSONNEL COMPENSATION,DETAIL,   ,   ,   ,KEITA KAMILAH Z,2021-01-03,2021-03-31,DEPUTY INFOMATION TECH. DIRECT,24232.27,2021
,2021 OFFICE OF THE SPEAKER,1,GENERAL EXPENDITURES,PERSONNEL COMPENSATION,DETAIL,   ,   ,   ,KUNDANIS GEORGE,2021-01-03,2021-03-31,DEPUTY CHIEF OF STAFF,42508.9,2021
,2021 OFFICE OF THE SPEAKER,1,GENERAL EXPENDITURES,PERSONNEL COMPENSATION,DETAIL,   ,   ,   ,LA ALISA M,2021-01-03,2021-03-31,SPECIAL ASST TO THE SPEAKER,22000,2021
,2021 OFFICE OF THE SPEAKER,1,GENERAL EXPENDITURES,PERSONNEL COMPENSATION,DETAIL,   ,   ,   ,LEE SERYEUNG,2021-01-03,2021-03-31,PRESS SECRETARY,19555.56,2021
,2021 OFFICE OF THE SPEAKER,1,GENERAL EXPENDITURES,PERSONNEL COMPENSATION,DETAIL,   ,   ,   ,LIZARRAGA JAIME E.,2021-01-03,2021-03-31,SENIOR ADVISOR,42508.9,2021
,2021 OFFICE OF THE SPEAKER,1,GENERAL EXPENDITURES,PERSONNEL COMPENSATION,DETAIL,   ,   ,   ,LONG MICHAEL G,2021-01-03,2021-03-31,SR ADV & DIR OF MBR SERV,31777.77,2021
,2021 OFFICE OF THE SPEAKER,1,GENERAL EXPENDITURES,PERSONNEL COMPENSATION,DETAIL,   ,   ,   ,LOPEZ RILEY M,2021-01-20,2021-03-31,PRESS ASSISTANT,6902.78,2021
,2021 OFFICE OF THE SPEAKER,1,GENERAL EXPENDITURES,PERSONNEL COMPENSATION,DETAIL,   ,   ,   ,LOPEZ RILEY M,2021-01-01,2021-02-28,PRESS ASSISTANT (OVERTIME),3066.67,2021
,2021 OFFICE OF THE SPEAKER,1,GENERAL EXPENDITURES,PERSONNEL COMPENSATION,DETAIL,   ,   ,   ,MANGRUM PEARL J.,2021-01-03,2021-03-31,FINANCIAL ADMINISTRATOR,35444.44,2021
,2021 OFFICE OF THE SPEAKER,1,GENERAL EXPENDITURES,PERSONNEL COMPENSATION,DETAIL,   ,   ,   ,MANSBACH SHANA G,2021-01-03,2021-03-31,DIRECTOR OF SPEECHWRITING,24444.44,2021
,2021 OFFICE OF THE SPEAKER,1,GENERAL EXPENDITURES,PERSONNEL COMPENSATION,DETAIL,   ,   ,   ,MARRON BRENNA K,2021-01-03,2021-03-31,DEPUTY EXEC DIRECTOR,28111.1,2021
,2021 OFFICE OF THE SPEAKER,1,GENERAL EXPENDITURES,PERSONNEL COMPENSATION,DETAIL,   ,   ,   ,MCCULLOUGH MARY T,2021-01-03,2021-03-31,CHIEF OF STAFF,42508.9,2021
,2021 OFFICE OF THE SPEAKER,1,GENERAL EXPENDITURES,PERSONNEL COMPENSATION,DETAIL,   ,   ,   ,MCCULLOUGH WILLIAM J,2021-01-03,2021-03-31,PRESS ADVISOR,9166.67,2021
,2021 OFFICE OF THE SPEAKER,1,GENERAL EXPENDITURES,PERSONNEL COMPENSATION,DETAIL,   ,   ,   ,MCCULLOUGH WILLIAM J,2021-01-01,2021-02-28,PRESS ADVISOR (OVERTIME),4563.5,2021
,2021 OFFICE OF THE SPEAKER,1,GENERAL EXPENDITURES,PERSONNEL COMPENSATION,DETAIL,   ,   ,   ,MELTZER RICHARD,2021-01-03,2021-03-31,POLICY DIRECTOR,42508.9,2021
,2021 OFFICE OF THE SPEAKER,1,GENERAL EXPENDITURES,PERSONNEL COMPENSATION,DETAIL,   ,   ,   ,MILLER MONTANA R,2021-01-03,2021-03-31,DEPUTY DIRECTOR OF SCHEDULING,15644.44,2021
,2021 OFFICE OF THE SPEAKER,1,GENERAL EXPENDITURES,PERSONNEL COMPENSATION,DETAIL,   ,   ,   ,MONGE KATHERINE S,2021-01-03,2021-03-31,SENIOR COUNSEL,42508.9,2021
,2021 OFFICE OF THE SPEAKER,1,GENERAL EXPENDITURES,PERSONNEL COMPENSATION,DETAIL,   ,   ,   ,PARKER WYNDEE R.,2021-01-03,2021-03-31,NATIONAL SECURITY ADVISOR,42508.9,2021
,2021 OFFICE OF THE SPEAKER,1,GENERAL EXPENDITURES,PERSONNEL COMPENSATION,DETAIL,   ,   ,   ,PATTERSON ROBYN M.,2021-01-19,2021-03-31,DEPUTY COMMUNICATIONS DIRECTOR,25000.01,2021
,2021 OFFICE OF THE SPEAKER,1,GENERAL EXPENDITURES,PERSONNEL COMPENSATION,DETAIL,   ,   ,   ,PAZ JR CARLOS,2021-01-03,2021-03-31,SENIOR COMMUNICATIONS ADVISOR,33000,2021
,2021 OFFICE OF THE SPEAKER,1,GENERAL EXPENDITURES,PERSONNEL COMPENSATION,DETAIL,   ,   ,   ,POWELL LATRICE S,2021-01-03,2021-03-31,DEPUTY FLOOR DIRECTOR,34222.23,2021
,2021 OFFICE OF THE SPEAKER,1,GENERAL EXPENDITURES,PERSONNEL COMPENSATION,DETAIL,   ,   ,   ,PRESLEY JESSICA A,2021-03-01,2021-03-31,DIRECTOR OF DIGITAL STRATEGY,7916.67,2021
,2021 OFFICE OF THE SPEAKER,1,GENERAL EXPENDITURES,PERSONNEL COMPENSATION,DETAIL,   ,   ,   ,PRICE REVA B.,2021-01-03,2021-03-31,OUTREACH DIR & SENIOR ADVISOR,35370.63,2021
,2021 OFFICE OF THE SPEAKER,1,GENERAL EXPENDITURES,PERSONNEL COMPENSATION,DETAIL,   ,   ,   ,PRIMUS WENDELL E.,2021-01-03,2021-03-31,SR HLTH/BUDGET POLICY ADV,42508.9,2021
,2021 OFFICE OF THE SPEAKER,1,GENERAL EXPENDITURES,PERSONNEL COMPENSATION,DETAIL,   ,   ,   ,RAMIREZ MATTHEW M,2021-01-05,2021-01-30,OUTREACH ADVISOR,437.5,2021
,2021 OFFICE OF THE SPEAKER,1,GENERAL EXPENDITURES,PERSONNEL COMPENSATION,DETAIL,   ,   ,   ,RAMIREZ MATTHEW M,2021-01-05,2021-01-30,OUTREACH ADVISOR (OTHER COMPENSATION),4375,2021
,2021 OFFICE OF THE SPEAKER,1,GENERAL EXPENDITURES,PERSONNEL COMPENSATION,DETAIL,   ,   ,   ,ROSS PATRICIA L,2021-01-03,2021-03-31,SENIOR POLICY ADVISOR,29211.1,2021
,2021 OFFICE OF THE SPEAKER,1,GENERAL EXPENDITURES,PERSONNEL COMPENSATION,DETAIL,   ,   ,   ,RUDD DIANA,2021-01-03,2021-03-31,MEMBER SERVICES DIR/COUNSEL,24500,2021
,2021 OFFICE OF THE SPEAKER,1,GENERAL EXPENDITURES,PERSONNEL COMPENSATION,DETAIL,   ,   ,   ,RUIZ XENIA F,2021-01-03,2021-03-31,OUTREACH DIRECTOR,25333.33,2021
,2021 OFFICE OF THE SPEAKER,1,GENERAL EXPENDITURES,PERSONNEL COMPENSATION,DETAIL,   ,   ,   ,RUSSELL MAYA A,2021-01-03,2021-03-31,DIGITAL DIRECTOR,13444.44,2021
,2021 OFFICE OF THE SPEAKER,1,GENERAL EXPENDITURES,PERSONNEL COMPENSATION,DETAIL,   ,   ,   ,SCANNELL BROOKE A,2021-03-01,2021-03-31,SENIOR POLICY ADVISOR,6158.33,2021
,2021 OFFICE OF THE SPEAKER,1,GENERAL EXPENDITURES,PERSONNEL COMPENSATION,DETAIL,   ,   ,   ,SMITH KELSEY L,2021-01-03,2021-03-31,DIR. OF SCHEDULING & ADVANCE,33444.45,2021
,2021 OFFICE OF THE SPEAKER,1,GENERAL EXPENDITURES,PERSONNEL COMPENSATION,DETAIL,   ,   ,   ,SMITH SHANE T,2021-01-03,2021-03-31,SENIOR ADVISOR/MEMBER SERVICES,19555.56,2021
,2021 OFFICE OF THE SPEAKER,1,GENERAL EXPENDITURES,PERSONNEL COMPENSATION,DETAIL,   ,   ,   ,STERN KEITH L.,2021-01-03,2021-03-31,DIRECTOR OF FLOOR OPERATIONS,42508.9,2021
,2021 OFFICE OF THE SPEAKER,1,GENERAL EXPENDITURES,PERSONNEL COMPENSATION,DETAIL,   ,   ,   ,SWIG SARAH B,2021-01-03,2021-03-01,POLICY ASSOCIATE,8604.16,2021
,2021 OFFICE OF THE SPEAKER,1,GENERAL EXPENDITURES,PERSONNEL COMPENSATION,DETAIL,   ,   ,   ,SWIG SARAH B,2021-03-01,2021-03-01,POLICY ASSOCIATE (OTHER COMPENSATION),4375,2021
,2021 OFFICE OF THE SPEAKER,1,GENERAL EXPENDITURES,PERSONNEL COMPENSATION,DETAIL,   ,   ,   ,TECKLENBURG MICHAEL H.,2021-01-03,2021-03-31,COUNSEL,34711.1,2021
,2021 OFFICE OF THE SPEAKER,1,GENERAL EXPENDITURES,PERSONNEL COMPENSATION,DETAIL,   ,   ,   ,URRY ALEXANDER M,2021-01-03,2021-03-31,POLICY ADVISOR,13444.44,2021
,2021 OFFICE OF THE SPEAKER,1,GENERAL EXPENDITURES,PERSONNEL COMPENSATION,DETAIL,   ,   ,   ,WOLFF CELINE K.,2021-01-03,2021-01-30,DEPUTY DIGITAL DIRECTOR,3927.78,2021
,2021 OFFICE OF THE SPEAKER,1,GENERAL EXPENDITURES,PERSONNEL COMPENSATION,DETAIL,   ,   ,   ,WOLFF CELINE K.,2021-01-30,2021-01-30,DEPUTY DIGITAL DIRECTOR (OTHER COMPENSATION),3226.39,2021
,2021 OFFICE OF THE SPEAKER,1,GENERAL EXPENDITURES,PERSONNEL COMPENSATION,DETAIL,   ,   ,   ,WOLTERS KATE,2021-01-03,2021-03-31,DIRECTOR OF SPECIAL EVENTS,2444.44,2021
,2021 OFFICE OF THE SPEAKER,1,GENERAL EXPENDITURES,PERSONNEL COMPENSATION,SUBTOTAL,   ,   ,   ,   ,   ,   ,PERSONNEL COMPENSATION TOTALS:,1599221.96,2021
,2021 OFFICE OF THE SPEAKER,1,GENERAL EXPENDITURES,TRAVEL,DETAIL,2021-02-01,AP,1379371,HIDALGO ADRIANA N.,2021-01-11,2021-01-11,TAXI/PARKING/TOLLS,43.25,2021
,2021 OFFICE OF THE SPEAKER,1,GENERAL EXPENDITURES,TRAVEL,SUBTOTAL,   ,   ,   ,   ,   ,   ,TRAVEL TOTALS:,43.25,2021
,2021 OFFICE OF THE SPEAKER,1,GENERAL EXPENDITURES,RENT  COMMUNICATION  UTILITIES,DETAIL,2021-01-27,GL,MED0103890, ,2021-01-05,2021-01-05,HIR GRAPHICS (TRANSFER),50,2021
,2021 OFFICE OF THE SPEAKER,1,GENERAL EXPENDITURES,RENT  COMMUNICATION  UTILITIES,DETAIL,2021-02-18,AP,1384267,FEDEX,2021-01-05,2021-01-05,POSTAGE / COURIER / BOX RENTAL,19.91,2021
,2021 OFFICE OF THE SPEAKER,1,GENERAL EXPENDITURES,RENT  COMMUNICATION  UTILITIES,DETAIL,2021-02-25,GL,EMS0104578, ,2021-01-01,2021-01-31,DC TELECOM EQUIP (TRANSFER),228,2021
,2021 OFFICE OF THE SPEAKER,1,GENERAL EXPENDITURES,RENT  COMMUNICATION  UTILITIES,DETAIL,2021-02-25,GL,EMS0104578, ,2021-01-01,2021-01-31,DC TELECOM SERV (TRANSFER),1212,2021
,2021 OFFICE OF THE SPEAKER,1,GENERAL EXPENDITURES,RENT  COMMUNICATION  UTILITIES,DETAIL,2021-02-25,GL,EMS0104578, ,2021-01-01,2021-01-31,DC TELECOM TOLLS (TRANSFER),10270.12,2021
,2021 OFFICE OF THE SPEAKER,1,GENERAL EXPENDITURES,RENT  COMMUNICATION  UTILITIES,DETAIL,2021-03-29,GL,HRS0105331, ,2021-02-01,2021-02-28,RECORDING - (TRANSFER),385,2021
,2021 OFFICE OF THE SPEAKER,1,GENERAL EXPENDITURES,RENT  COMMUNICATION  UTILITIES,DETAIL,2021-03-29,GL,MED0105330, ,2021-03-02,2021-03-16,HIR GRAPHICS (TRANSFER),140,2021
,2021 OFFICE OF THE SPEAKER,1,GENERAL EXPENDITURES,RENT  COMMUNICATION  UTILITIES,DETAIL,2021-03-30,GL,EMS0105388, ,2021-02-01,2021-02-28,DC TELECOM EQUIP (TRANSFER),228,2021
,2021 OFFICE OF THE SPEAKER,1,GENERAL EXPENDITURES,RENT  COMMUNICATION  UTILITIES,DETAIL,2021-03-30,GL,EMS0105388, ,2021-02-01,2021-02-28,DC TELECOM SERV (TRANSFER),1212,2021
,2021 OFFICE OF THE SPEAKER,1,GENERAL EXPENDITURES,RENT  COMMUNICATION  UTILITIES,DETAIL,2021-03-30,GL,EMS0105388, ,2021-02-01,2021-02-28,DC TELECOM TOLLS (TRANSFER),9403.7,2021
,2021 OFFICE OF THE SPEAKER,1,GENERAL EXPENDITURES,RENT  COMMUNICATION  UTILITIES,SUBTOTAL,   ,   ,   ,   ,   ,   ,RENT  COMMUNICATION  UTILITIES TOTALS:,23148.73,2021
,2021 OFFICE OF THE SPEAKER,1,GENERAL EXPENDITURES,PRINTING AND REPRODUCTION,DETAIL,2021-01-21,AP,1373222,ACCURATE WORD LLC,2021-01-04,2021-01-04,PRINTING & REPRODUCTION,2447,2021
,2021 OFFICE OF THE SPEAKER,1,GENERAL EXPENDITURES,PRINTING AND REPRODUCTION,DETAIL,2021-01-27,GL,MED0103890, ,2021-01-15,2021-01-15,PHOTOGRAPHIC (TRANSFER),400,2021
,2021 OFFICE OF THE SPEAKER,1,GENERAL EXPENDITURES,PRINTING AND REPRODUCTION,DETAIL,2021-02-17,AP,1384178,CITI PCARD-B&H PHOTO 800-606-6969,2021-01-15,2021-01-15,PRINTING & REPRODUCTION,251.82,2021
,2021 OFFICE OF THE SPEAKER,1,GENERAL EXPENDITURES,PRINTING AND REPRODUCTION,DETAIL,2021-03-01,AP,1389119,ACCURATE WORD LLC,2021-02-02,2021-02-02,PRINTING & REPRODUCTION,129,2021
,2021 OFFICE OF THE SPEAKER,1,GENERAL EXPENDITURES,PRINTING AND REPRODUCTION,DETAIL,2021-03-01,AP,1389120,ACCURATE WORD LLC,2021-02-05,2021-02-05,PRINTING & REPRODUCTION,43,2021
,2021 OFFICE OF THE SPEAKER,1,GENERAL EXPENDITURES,PRINTING AND REPRODUCTION,DETAIL,2021-03-29,GL,MED0105330, ,2021-03-05,2021-03-25,PHOTOGRAPHIC (TRANSFER),173.2,2021
,2021 OFFICE OF THE SPEAKER,1,GENERAL EXPENDITURES,PRINTING AND REPRODUCTION,SUBTOTAL,   ,   ,   ,   ,   ,   ,PRINTING AND REPRODUCTION TOTALS:,3444.02,2021
,2021 OFFICE OF THE SPEAKER,1,GENERAL EXPENDITURES,OTHER SERVICES,DETAIL,2021-01-27,AP,1378292,LEIDOS DIGITAL SOLUTIONS INC,2021-01-01,2021-01-31,TECHNOLOGY SERVICE CONTRACTS,1925,2021
,2021 OFFICE OF THE SPEAKER,1,GENERAL EXPENDITURES,OTHER SERVICES,DETAIL,2021-01-27,AP,1378293,LEIDOS DIGITAL SOLUTIONS INC,2021-01-01,2021-01-31,TECHNOLOGY SERVICE CONTRACTS,10594,2021
,2021 OFFICE OF THE SPEAKER,1,GENERAL EXPENDITURES,OTHER SERVICES,DETAIL,2021-02-16,AP,1386469,LEIDOS DIGITAL SOLUTIONS INC,2021-02-01,2021-02-28,TECHNOLOGY SERVICE CONTRACTS,1925,2021
,2021 OFFICE OF THE SPEAKER,1,GENERAL EXPENDITURES,OTHER SERVICES,DETAIL,2021-02-16,AP,1386470,LEIDOS DIGITAL SOLUTIONS INC,2021-02-01,2021-02-28,TECHNOLOGY SERVICE CONTRACTS,10594,2021
,2021 OFFICE OF THE SPEAKER,1,GENERAL EXPENDITURES,OTHER SERVICES,DETAIL,2021-02-26,AP,1390954,FIRESIDE21,2021-01-01,2021-01-31,WEB DEV HST EMAIL & RLTD SERV,350,2021
,2021 OFFICE OF THE SPEAKER,1,GENERAL EXPENDITURES,OTHER SERVICES,DETAIL,2021-03-16,AP,1397729,LEIDOS DIGITAL SOLUTIONS INC,2021-03-01,2021-03-31,TECHNOLOGY SERVICE CONTRACTS,1925,2021
,2021 OFFICE OF THE SPEAKER,1,GENERAL EXPENDITURES,OTHER SERVICES,DETAIL,2021-03-16,AP,1397730,LEIDOS DIGITAL SOLUTIONS INC,2021-03-01,2021-03-31,TECHNOLOGY SERVICE CONTRACTS,10594,2021
,2021 OFFICE OF THE SPEAKER,1,GENERAL EXPENDITURES,OTHER SERVICES,DETAIL,2021-03-29,AP,1402222,FIRESIDE21,2021-02-01,2021-02-28,WEB DEV HST EMAIL & RLTD SERV,350,2021
,2021 OFFICE OF THE SPEAKER,1,GENERAL EXPENDITURES,OTHER SERVICES,SUBTOTAL,   ,   ,   ,   ,   ,   ,OTHER SERVICES TOTALS:,38257,2021
,2021 OFFICE OF THE SPEAKER,1,GENERAL EXPENDITURES,SUPPLIES AND MATERIALS,DETAIL,2021-01-19,AP,1376276,HAGUE QUALITY WATER OF MD INC,2021-01-01,2021-12-31,WATER,756,2021
,2021 OFFICE OF THE SPEAKER,1,GENERAL EXPENDITURES,SUPPLIES AND MATERIALS,DETAIL,2021-01-21,AP,1373221,HAGUE QUALITY WATER OF MD INC,2021-01-01,2021-12-31,WATER,4536,2021
,2021 OFFICE OF THE SPEAKER,1,GENERAL EXPENDITURES,SUPPLIES AND MATERIALS,DETAIL,2021-01-31,GL,RMS0104032, ,2021-01-01,2021-01-31,OFFICE SUPPLY (TRANSFER),1999.56,2021
,2021 OFFICE OF THE SPEAKER,1,GENERAL EXPENDITURES,SUPPLIES AND MATERIALS,DETAIL,2021-02-16,AP,1384205,CITI PCARD-LEVELUPSWEETGREEN3671,2021-01-03,2021-01-03,FOOD & BEVERAGE,71.17,2021
,2021 OFFICE OF THE SPEAKER,1,GENERAL EXPENDITURES,SUPPLIES AND MATERIALS,DETAIL,2021-02-16,AP,1384205,CITI PCARD-TARGET PLUS,2021-01-12,2021-01-12,OFFICE SUPPLIES (OUTSIDE),84.78,2021
,2021 OFFICE OF THE SPEAKER,1,GENERAL EXPENDITURES,SUPPLIES AND MATERIALS,DETAIL,2021-02-16,AP,1384205,CITI PCARD-TARGET.COM,2021-01-12,2021-01-12,FOOD & BEVERAGE,26.86,2021
,2021 OFFICE OF THE SPEAKER,1,GENERAL EXPENDITURES,SUPPLIES AND MATERIALS,DETAIL,2021-02-16,AP,1384205,CITI PCARD-TARGET.COM,2021-01-12,2021-01-12,OFFICE SUPPLIES (OUTSIDE),84.76,2021
,2021 OFFICE OF THE SPEAKER,1,GENERAL EXPENDITURES,SUPPLIES AND MATERIALS,DETAIL,2021-02-16,AP,1384205,CITI PCARD-WE THE PIZZA,2021-01-07,2021-01-07,FOOD & BEVERAGE,204.7,2021
,2021 OFFICE OF THE SPEAKER,1,GENERAL EXPENDITURES,SUPPLIES AND MATERIALS,DETAIL,2021-02-16,AP,1384205,CITI PCARD-WE THE PIZZA,2021-01-12,2021-01-12,FOOD & BEVERAGE,155.3,2021
,2021 OFFICE OF THE SPEAKER,1,GENERAL EXPENDITURES,SUPPLIES AND MATERIALS,DETAIL,2021-02-16,AP,1384260,TOULIES EN FLEUR,2021-02-01,2021-02-22,HABITATION EXPENSE,1050,2021
,2021 OFFICE OF THE SPEAKER,1,GENERAL EXPENDITURES,SUPPLIES AND MATERIALS,DETAIL,2021-02-16,AP,1384263,SUBURBAN FLORIST INC,2021-02-02,2021-02-02,HABITATION EXPENSE,520,2021
,2021 OFFICE OF THE SPEAKER,1,GENERAL EXPENDITURES,SUPPLIES AND MATERIALS,DETAIL,2021-02-17,AP,1384178,CITI PCARD-AMZN Mktp US MO6GH9I63,2021-01-03,2021-01-03,OFFICE SUPPLIES (OUTSIDE),27.43,2021
,2021 OFFICE OF THE SPEAKER,1,GENERAL EXPENDITURES,SUPPLIES AND MATERIALS,DETAIL,2021-02-17,AP,1384178,CITI PCARD-BESTBUYCOM806407009863,2021-01-04,2021-01-04,OFFICE SUPPLIES (OUTSIDE),179.98,2021
,2021 OFFICE OF THE SPEAKER,1,GENERAL EXPENDITURES,SUPPLIES AND MATERIALS,DETAIL,2021-02-17,AP,1384178,CITI PCARD-DNH GODADDY.COM EUROPE,2021-01-20,2021-01-20,SOFTWARE  LESS THAN  $500,126.64,2021
,2021 OFFICE OF THE SPEAKER,1,GENERAL EXPENDITURES,SUPPLIES AND MATERIALS,DETAIL,2021-02-17,AP,1384178,CITI PCARD-DROPBOX DNMSNXK1Y3B8,2021-01-14,2021-01-14,SOFTWARE  LESS THAN  $500,127.07,2021
,2021 OFFICE OF THE SPEAKER,1,GENERAL EXPENDITURES,SUPPLIES AND MATERIALS,DETAIL,2021-02-17,AP,1384178,CITI PCARD-ENVATO,2021-01-05,2021-01-05,PUBLICATIONS/REFERENCE MAT'L,447,2021
,2021 OFFICE OF THE SPEAKER,1,GENERAL EXPENDITURES,SUPPLIES AND MATERIALS,DETAIL,2021-02-17,AP,1384178,CITI PCARD-SKYPE.COM/GO/BILL,2021-01-24,2021-01-24,SOFTWARE  LESS THAN  $500,2.99,2021
,2021 OFFICE OF THE SPEAKER,1,GENERAL EXPENDITURES,SUPPLIES AND MATERIALS,DETAIL,2021-02-17,AP,1384259,TOULIES EN FLEUR,2021-01-19,2021-01-19,HABITATION EXPENSE,350,2021
,2021 OFFICE OF THE SPEAKER,1,GENERAL EXPENDITURES,SUPPLIES AND MATERIALS,DETAIL,2021-02-17,AP,1384259,TOULIES EN FLEUR,2021-01-25,2021-01-25,HABITATION EXPENSE,350,2021
,2021 OFFICE OF THE SPEAKER,1,GENERAL EXPENDITURES,SUPPLIES AND MATERIALS,DETAIL,2021-02-17,AP,1385095,SODEXO,2021-02-03,2021-02-03,WATER,120,2021
,2021 OFFICE OF THE SPEAKER,1,GENERAL EXPENDITURES,SUPPLIES AND MATERIALS,DETAIL,2021-02-28,GL,RMS0104712, ,2021-02-01,2021-02-28,OFFICE SUPPLY (TRANSFER),206.29,2021
,2021 OFFICE OF THE SPEAKER,1,GENERAL EXPENDITURES,SUPPLIES AND MATERIALS,DETAIL,2021-03-16,AP,1396069,LIZARRAGA JAIME E.,2021-01-25,2021-01-25,OFFICE SUPPLIES (OUTSIDE),7.4,2021
,2021 OFFICE OF THE SPEAKER,1,GENERAL EXPENDITURES,SUPPLIES AND MATERIALS,DETAIL,2021-03-16,AP,1396069,LIZARRAGA JAIME E.,2021-02-16,2021-02-16,OFFICE SUPPLIES (OUTSIDE),34.22,2021
,2021 OFFICE OF THE SPEAKER,1,GENERAL EXPENDITURES,SUPPLIES AND MATERIALS,DETAIL,2021-03-17,AP,1395995,CITI PCARD-AMZN Mktp US,2021-02-12,2021-02-12,OFFICE SUPPLIES (OUTSIDE),-158.97,2021
,2021 OFFICE OF THE SPEAKER,1,GENERAL EXPENDITURES,SUPPLIES AND MATERIALS,DETAIL,2021-03-17,AP,1395995,CITI PCARD-AMZN Mktp US 1E8SE75S3,2021-02-17,2021-02-17,OFFICE SUPPLIES (OUTSIDE),129.95,2021